{"text_format":"1","workbook":"xlsx","n_sheets":10,"sheets":["Introduktion","Konfiguration","Input","Beregninger","Ventilation","Gulvvarme","Data fra producenter","Regression","Regression - bøjninger","Drop-down"],"not_rendered":{"charts":2,"images":3,"macros":1,"external_links":0,"defined_names":0,"comments":2,"pivot_tables":0},"unopened":[],"bounds":{"document_bytes":16777216,"sheet_cells":100000,"rows_first":2000,"rows_last":500,"rows_between":2000,"halvings":0,"cell_chars":16384,"cell_head_chars":4096},"cells_cut":0,"cells_raw":0,"read":"whole","date_system":"1900"}

{"sheet":"Introduktion","index":0,"n_rows":0,"n_cols":0,"rows_kept":0,"cut":false,"hidden":false,"merged":[]}

{"sheet":"Konfiguration","index":1,"n_rows":12,"n_cols":3,"rows_kept":12,"cut":false,"hidden":false,"merged":[]}
["Valg","Indtastning","Kommentarer"]
["Hustype","2-plan"]
["Tagtype","Sadeltag"]
["Brutto areal",135]
["Netto areal",115]
["Loftshøjde",2.95]
["Antal værelser",6]
["Antal wc-rum uden bad",0]
["Antal bade- og wc-rum",1]
["Antal depot/bryggers/viktualierum",1]
{"$rows_left_out":3}
{"sheet":"Input","index":2,"n_rows":16,"n_cols":12,"rows_kept":16,"cut":false,"hidden":false,"merged":[[1,0,1,5],[1,6,1,11],[6,0,6,5]]}
[]
["Ventilation",null,null,null,null,null,"Bolig information"]
[]
[null,"Ækvivalent længde af Ø125mm ventilationskanal ",null,null,{"$f":"Beregninger!G33","v":50.672002836397169},"m",null,"Hustype",null,null,{"$f":"Konfiguration!B2","v":"2-plan"}]
[null,"Ækvivalent materialemængde af Ø125mm ventilationskanal",null,null,{"$f":"Beregninger!G34","v":74.687929979792443},"kg",null,"Tagtype",null,null,{"$f":"Konfiguration!B3","v":"Sadeltag"}]
[null,null,null,null,null,null,null,"Rumfang",null,null,{"$f":"Konfiguration!B5*Konfiguration!B6","v":339.25},"m3"]
["Yderligere information vedr. ventilation",null,null,null,null,null,null,"Antal værelser",null,null,{"$f":"Konfiguration!B7","v":6},"stk"]
[null,null,null,null,null,null,null,"Antal wc-rum uden bad",null,null,{"$f":"Konfiguration!B8","v":0},"stk"]
[null,"Antal udsugningsarmaturer",null,null,{"$f":"Beregninger!L9","v":3},"stk",null,"Antal bade- og wc-rum",null,null,{"$f":"Konfiguration!B9","v":1},"stk"]
[null,"Antal indblæsningsarmaturer",null,null,{"$f":"Beregninger!L10","v":7},"stk",null,"Antal depoter/bryggers/viktualierum",null,null,{"$f":"Konfiguration!B10","v":1},"stk"]
{"$rows_left_out":7}
{"sheet":"Beregninger","index":3,"n_rows":34,"n_cols":12,"rows_kept":34,"cut":false,"hidden":true,"merged":[[5,2,6,12],[14,2,15,12]]}
[]
[]
[]
[]
[]
[null,null,"Luftmængder, luftskifte og armaturer"]
[]
[]
[null,null,"Basis ventilation",null,null,null,{"$f":"Input!K12*0.3*3.6","v":145.80000000000001},"m3/h",null,"Antal udsugningsarmaturer",null,{"$f":"IF(Input!K10>2,Input!K8+Input!K9+Input!K10+Input!K11-1,Input!K8+Input!K9+Input!K10+Input!K11)","v":3}]
[null,null,"Forceret ventilation",null,null,null,{"$f":"(MAX(G9,Input!K11*72+Input!K9*54+Input!K10*36+Input!K8*36))","v":162},"m3/h",null,"Antal indblæsningsarmaturer",null,{"$f":"IF(Konfiguration!B12=\"Ja\",Input!K7+1,Input!K7)","v":7}]
{"$rows_left_out":25}
{"sheet":"Ventilation","index":4,"n_rows":16,"n_cols":17,"rows_kept":16,"cut":false,"hidden":true,"merged":[[11,12,11,13],[11,15,11,16],[1,11,2,17],[1,1,2,8],[4,2,4,7],[4,12,4,14]]}
[]
[null,"Mateialedata på kanal.",null,null,null,null,null,null,null,null,null,"Materialedata på bøjninger og samlinger. "]
[]
[]
[null,null,"Rør - Lindab",null,null,null,null,null,null,null,null,null,"Bøjninger - Air2Trust"]
[null,null,"Ød [mm]","Omkr. [m]","Areal [m2]","t [mm]","vægt [kg/m]","Forhold",null,null,null,null,"Ød [mm]","vægt [kg]","Forhold"]
[null,null,100,0.314,8.0000000000000002E-3,0.45,1.1399999999999999,{"$f":"G7/G8","v":0.80851063829787229},null,null,null,null,100,0.4,{"$f":"N7/N8","v":0.66666666666666674}]
[null,null,125,0.39300000000000002,1.2E-2,0.45,1.41,{"$f":"G8/G8","v":1},null,null,null,null,125,0.6,{"$f":"N8/N8","v":1}]
[null,null,160,0.503,0.02,0.5,2.02,{"$f":"G9/G8","v":1.4326241134751774},null,null,null,null,160,1,{"$f":"N9/N8","v":1.6666666666666667}]
[]
{"$rows_left_out":7}
{"sheet":"Gulvvarme","index":5,"n_rows":11,"n_cols":10,"rows_kept":11,"cut":false,"hidden":true,"merged":[[3,2,3,9],[1,1,1,10]]}
[]
[null,"Materialedata på gulvvarmerør"]
[]
[null,null,"Gulvvarmerør - Uponor/Wirsbo"]
[null,null,"Ød [mm]","t [mm]","Areal [mm2]","Rørtype","Centerafstand [mm]","Max kredslængde [m]","Rørforbrug [m/m2]","kg/m"]
[null,null,12,1.7,{"$f":"(C6-(2*D6))*PI()","v":27.017696820872221},"evalPEX",125,70,8.1999999999999993,6.8000000000000005E-2]
[null,null,15,2.5,{"$f":"(C7-(2*D7))*PI()","v":31.415926535897931},"evalPEX",200,75,5,9.4E-2]
[null,null,16,2,37.699111843077517,"Unipipe",250,80,4,8.5000000000000006E-2]
[null,null,17,2,40.840704496667314,"pePEX",200,80,5,{"$f":"11.3/100","v":0.113}]
[null,null,20,2,50.26548245743669,"pePEX",300,120,3.3,{"$f":"11.7/100","v":0.11699999999999999}]
{"$rows_left_out":2}
{"sheet":"Data fra producenter","index":6,"n_rows":110,"n_cols":68,"rows_kept":110,"cut":false,"hidden":true,"merged":[[56,44,57,45],[1,38,2,39],[23,38,24,39],[1,42,2,46],[34,44,35,45],[45,44,46,45]]}
[]
[null,"Huse","Producent","Type","Tag","Type-værdi","Tag-værdi","Antal værelser","Brutto","Netto","B/N","Kanallængde pr. kvdm","Højde","Samlet kanallængde [m","Antal bøjninger","Køkkenalrum","Gulvvarme - c.afstand","Gulvvarme længde","Gulvvarme m/m2","Gulvvarme kg","Gulvvarme kg/m2","Gulvvarme m2","Gulvvarme m2/m2","Gulvvarme antal kredse","Indblæsning","Udsugning","Emhætte ","Emhætte - kanallængde","Kanal - Ind","Kanal - Ud","Kanal - Indtag/afkast","Aggregat","Aggregat - placering","Aggregat - luftmin","Aggregat - luftmax","kvmd/værelse forhold",null,null,"Værdier fra producenter (Skal udbygges med mere data for at blive mere retvisende)",null,null,null,"Gulvarme"]
[null,"Bygning 2","pro_13","1 plans","Ensidig hældning",{"$f":"IF(Table1[[#This Row],[Type]]=\"1 plans\",1,IF(Table1[[#This Row],[Type]]=\"2 plans\",2,0))","v":1},{"$f":"IF(Table1[[#This Row],[Tag]]=\"Ensidig hældning\",2,IF(Table1[[#This Row],[Tag]]=\"Fladt\",3,IF(Table1[[#This Row],[Tag]]=\"Sadel\",1,0)))","v":2},6,166,135.30000000000001,{"$f":"IF(Table1[[#This Row],[Netto]]=\" \",\" \",Table1[[#This Row],[Brutto]]/Table1[[#This Row],[Netto]])","v":1.2269031781226902},{"$f":"(AC3+AD3+Table1[[#This Row],[Kanal - Indtag/afkast]])/I3","v":0.27710843373493976},2.75,{"$f":"Table1[[#This Row],[Emhætte - kanallængde]]+Table1[[#This Row],[Kanal - Ind]]+Table1[[#This Row],[Kanal - Ud]]+Table1[[#This Row],[Kanal - Indtag/afkast]]","v":48.25},18,"Ja",null,null,{"$f":"Table1[[#This Row],[Gulvvarme længde]]/Table1[[#This Row],[Netto]]","v":0},{"$f":"IF(Table1[[#This Row],[Gulvvarme - c.afstand]]=200,(Table1[[#This Row],[Gulvvarme længde]]*Gulvvarme!J$9),IF(Table1[[#This Row],[Gulvvarme - c.afstand]]=250,Table1[[#This Row],[Gulvvarme længde]]*Gulvvarme!J$8,Table1[[#This Row],[Gulvvarme længde]]*Gulvvarme!J$10))","v":0},{"$f":"Table1[[#This Row],[Gulvvarme kg]]/Table1[[#This Row],[Netto]]","v":0},{"$f":"IF(Table1[[#This Row],[Gulvvarme - c.afstand]]=250,Table1[[#This Row],[Gulvvarme længde]]/Gulvvarme!I$8,IF(Table1[[#This Row],[Gulvvarme - c.afstand]]=300,Table1[[#This Row],[Gulvvarme længde]]/Gulvvarme!I$10,\"\"))","v":""},{"$f":"Table1[[#This Row],[Gulvvarme m2]]/Table1[[#This Row],[Netto]]","v":{"$error":"#VALUE!"}},null,5,4,1,2.25,22.5,16,7.5,"Danfoss Air W2","Væg",50,300,{"$f":"J3/H3","v":22.55}]
[null,"Bygning 6 ","pro_13","1 plans","Ensidig hældning",{"$f":"IF(Table1[[#This Row],[Type]]=\"1 plans\",1,IF(Table1[[#This Row],[Type]]=\"2 plans\",2,0))","v":1},{"$f":"IF(Table1[[#This Row],[Tag]]=\"Ensidig hældning\",2,IF(Table1[[#This Row],[Tag]]=\"Fladt\",3,IF(Table1[[#This Row],[Tag]]=\"Sadel\",1,0)))","v":2},7,168,150.9,{"$f":"IF(Table1[[#This Row],[Netto]]=\" \",\" \",Table1[[#This Row],[Brutto]]/Table1[[#This Row],[Netto]])","v":1.1133200795228628},{"$f":"(AC4+AD4+Table1[[#This Row],[Kanal - Indtag/afkast]])/I4","v":0.27976190476190477},3.5,{"$f":"Table1[[#This Row],[Emhætte - kanallængde]]+Table1[[#This Row],[Kanal - Ind]]+Table1[[#This Row],[Kanal - Ud]]+Table1[[#This Row],[Kanal - Indtag/afkast]]","v":49.75},23,"Ja",null,null,{"$f":"Table1[[#This Row],[Gulvvarme længde]]/Table1[[#This Row],[Netto]]","v":0},{"$f":"IF(Table1[[#This Row],[Gulvvarme - c.afstand]]=200,(Table1[[#This Row],[Gulvvarme længde]]*Gulvvarme!J$9),IF(Table1[[#This Row],[Gulvvarme - c.afstand]]=250,Table1[[#This Row],[Gulvvarme længde]]*Gulvvarme!J$8,Table1[[#This Row],[Gulvvarme længde]]*Gulvvarme!J$10))","v":0},{"$f":"Table1[[#This Row],[Gulvvarme kg]]/Table1[[#This Row],[Netto]]","v":0},{"$f":"IF(Table1[[#This Row],[Gulvvarme - c.afstand]]=250,Table1[[#This Row],[Gulvvarme længde]]/Gulvvarme!I$8,IF(Table1[[#This Row],[Gulvvarme - c.afstand]]=300,Table1[[#This Row],[Gulvvarme længde]]/Gulvvarme!I$10,\"\"))","v":""},{"$f":"Table1[[#This Row],[Gulvvarme m2]]/Table1[[#This Row],[Netto]]","v":{"$error":"#VALUE!"}},null,6,4,1,2.75,25,16,6,"Dantherm HCV400P2","Skab",70,290,21.557142857142857]
[null,"Bygning 7","pro_14","1 plans","Ensidig hældning",{"$f":"IF(Table1[[#This Row],[Type]]=\"1 plans\",1,IF(Table1[[#This Row],[Type]]=\"2 plans\",2,0))","v":1},{"$f":"IF(Table1[[#This Row],[Tag]]=\"Ensidig hældning\",2,IF(Table1[[#This Row],[Tag]]=\"Fladt\",3,IF(Table1[[#This Row],[Tag]]=\"Sadel\",1,0)))","v":2},6,182.4,151.9,{"$f":"IF(Table1[[#This Row],[Netto]]=\" \",\" \",Table1[[#This Row],[Brutto]]/Table1[[#This Row],[Netto]])","v":1.2007899934167214},{"$f":"(AC5+AD5+Table1[[#This Row],[Kanal - Indtag/afkast]])/I5","v":0.34375},2.75,{"$f":"Table1[[#This Row],[Emhætte - kanallængde]]+Table1[[#This Row],[Kanal - Ind]]+Table1[[#This Row],[Kanal - Ud]]+Table1[[#This Row],[Kanal - Indtag/afkast]]","v":65.3},22,"Ja",null,{"$f":"(36+55+44+87+95+43+60)","v":420},{"$f":"Table1[[#This Row],[Gulvvarme længde]]/Table1[[#This Row],[Netto]]","v":2.7649769585253456},{"$f":"IF(Table1[[#This Row],[Gulvvarme - c.afstand]]=200,(Table1[[#This Row],[Gulvvarme længde]]*Gulvvarme!J$9),IF(Table1[[#This Row],[Gulvvarme - c.afstand]]=250,Table1[[#This Row],[Gulvvarme længde]]*Gulvvarme!J$8,Table1[[#This Row],[Gulvvarme længde]]*Gulvvarme!J$10))","v":49.14},{"$f":"Table1[[#This Row],[Gulvvarme kg]]/Table1[[#This Row],[Netto]]","v":0.32350230414746545},{"$f":"IF(Table1[[#This Row],[Gulvvarme - c.afstand]]=250,Table1[[#This Row],[Gulvvarme længde]]/Gulvvarme!I$8,IF(Table1[[#This Row],[Gulvvarme - c.afstand]]=300,Table1[[#This Row],[Gulvvarme længde]]/Gulvvarme!I$10,\"\"))","v":""},{"$f":"Table1[[#This Row],[Gulvvarme m2]]/Table1[[#This Row],[Netto]]","v":{"$error":"#VALUE!"}},null,6,6,1,2.6,25,32,5.7,"Nilan CT300LR","Skab",100,400,25.316666666666666,null,null,null,null,null,null,"Gennemsnit - m/m2",{"$f":"AVERAGE(Table1[Gulvvarme m/m2])","v":2.319966870592411},null,"Gennemsnit - kg",{"$f":"AVERAGE(Table1[Gulvvarme kg])","v":32.368333333333332}]
[null,"Type 1 - Bygning 2","pro_12","1 plans","Fladt",{"$f":"IF(Table1[[#This Row],[Type]]=\"1 plans\",1,IF(Table1[[#This Row],[Type]]=\"2 plans\",2,0))","v":1},{"$f":"IF(Table1[[#This Row],[Tag]]=\"Ensidig hældning\",2,IF(Table1[[#This Row],[Tag]]=\"Fladt\",3,IF(Table1[[#This Row],[Tag]]=\"Sadel\",1,0)))","v":3},6,170,{"$f":"7.7+10+8.1+10+11.9+5.6+37.9+2.8+24.1+7.5+12.1+3.4","v":141.1},{"$f":"IF(Table1[[#This Row],[Netto]]=\" \",\" \",Table1[[#This Row],[Brutto]]/Table1[[#This Row],[Netto]])","v":1.2048192771084338},{"$f":"(AC6+AD6+Table1[[#This Row],[Kanal - Indtag/afkast]])/I6","v":0.35588235294117648},{"$f":"((37.9/J6)*3+(1-(37.9/J6))*2.5)","v":2.6343019135364991},{"$f":"Table1[[#This Row],[Emhætte - kanallængde]]+Table1[[#This Row],[Kanal - Ind]]+Table1[[#This Row],[Kanal - Ud]]+Table1[[#This Row],[Kanal - Indtag/afkast]]","v":60.5},23,"Ja",300,{"$f":"28.7+43.3+45.3+36.3+33.3+109.3+70.3+60+83+79+27.7+47.7+31","v":694.90000000000009},{"$f":"Table1[[#This Row],[Gulvvarme længde]]/Table1[[#This Row],[Netto]]","v":4.9248759744861808},{"$f":"IF(Table1[[#This Row],[Gulvvarme - c.afstand]]=200,(Table1[[#This Row],[Gulvvarme længde]]*Gulvvarme!J$9),IF(Table1[[#This Row],[Gulvvarme - c.afstand]]=250,Table1[[#This Row],[Gulvvarme længde]]*Gulvvarme!J$8,Table1[[#This Row],[Gulvvarme længde]]*Gulvvarme!J$10))","v":81.303300000000007},{"$f":"Table1[[#This Row],[Gulvvarme kg]]/Table1[[#This Row],[Netto]]","v":0.57621048901488314},{"$f":"IF(Table1[[#This Row],[Gulvvarme - c.afstand]]=250,Table1[[#This Row],[Gulvvarme længde]]/Gulvvarme!I$8,IF(Table1[[#This Row],[Gulvvarme - c.afstand]]=300,Table1[[#This Row],[Gulvvarme længde]]/Gulvvarme!I$10,\"\"))","v":210.57575757575762},{"$f":"Table1[[#This Row],[Gulvvarme m2]]/Table1[[#This Row],[Netto]]","v":1.4923866589352064},13,6,4,0,0,{"$f":"((4335-1570)+(1170)+(3800-780)+(780)+(780)+(580)+((12120+8270)-(1250+435)))/1000","v":27.8},{"$f":"((3030+1210)+900+450+450+225+12100+(1125+2000+2500)+(2000+3000+1210))/1000","v":30.2},2.5,"Nilan CT300","Skab",100,400,23.516666666666666,null,null,"pro_12 - gennemsnit",{"$f":"AVERAGEIF(Table1[Producent], \"pro_12\",Table1[Kanallængde pr. kvdm])","v":0.31992865218159339},null,null,"pro_12 - gennemsnit",{"$f":"AVERAGEIF(Table1[Producent], \"pro_12\",Table1[Gulvvarme m/m2])","v":5.0583194095575692},null,"pro_12 - gennemsnit",{"$f":"AVERAGEIF(Table1[Producent], \"pro_12\",Table1[Gulvvarme kg])","v":82.29}]
[null,"Type 2 - Bygning 4","pro_12","1 plans","Fladt",{"$f":"IF(Table1[[#This Row],[Type]]=\"1 plans\",1,IF(Table1[[#This Row],[Type]]=\"2 plans\",2,0))","v":1},{"$f":"IF(Table1[[#This Row],[Tag]]=\"Ensidig hældning\",2,IF(Table1[[#This Row],[Tag]]=\"Fladt\",3,IF(Table1[[#This Row],[Tag]]=\"Sadel\",1,0)))","v":3},6,150,{"$f":"6.6+13.5+21.5+33.1+8+2.1+10.1+10+7.7+5.3+7.7","v":125.6},{"$f":"IF(Table1[[#This Row],[Netto]]=\" \",\" \",Table1[[#This Row],[Brutto]]/Table1[[#This Row],[Netto]])","v":1.1942675159235669},{"$f":"(AC7+AD7+Table1[[#This Row],[Kanal - Indtag/afkast]])/I7","v":0.30613333333333337},2.5499999999999998,{"$f":"Table1[[#This Row],[Emhætte - kanallængde]]+Table1[[#This Row],[Kanal - Ind]]+Table1[[#This Row],[Kanal - Ud]]+Table1[[#This Row],[Kanal - Indtag/afkast]]","v":45.92},{"$f":"6+10+7","v":23},"Ja",300,{"$f":"36+40+25+55+55+70+85+75+120+20+45+30","v":656},{"$f":"Table1[[#This Row],[Gulvvarme længde]]/Table1[[#This Row],[Netto]]","v":5.2229299363057331},{"$f":"IF(Table1[[#This Row],[Gulvvarme - c.afstand]]=200,(Table1[[#This Row],[Gulvvarme længde]]*Gulvvarme!J$9),IF(Table1[[#This Row],[Gulvvarme - c.afstand]]=250,Table1[[#This Row],[Gulvvarme længde]]*Gulvvarme!J$8,Table1[[#This Row],[Gulvvarme længde]]*Gulvvarme!J$10))","v":76.751999999999995},{"$f":"Table1[[#This Row],[Gulvvarme kg]]/Table1[[#This Row],[Netto]]","v":0.6110828025477707},{"$f":"IF(Table1[[#This Row],[Gulvvarme - c.afstand]]=250,Table1[[#This Row],[Gulvvarme længde]]/Gulvvarme!I$8,IF(Table1[[#This Row],[Gulvvarme - c.afstand]]=300,Table1[[#This Row],[Gulvvarme længde]]/Gulvvarme!I$10,\"\"))","v":198.78787878787881},{"$f":"Table1[[#This Row],[Gulvvarme m2]]/Table1[[#This Row],[Netto]]","v":1.5827060413047678},12,6,4,0,0,{"$f":"((6500+2500+500)+900+300+300+300+(5710-900-1500)+900+(600+600+2860+1120)+3080)/1000","v":23.77},{"$f":"((5650+3550)+2850+900+200+3250+3250)/1000","v":19.649999999999999},2.5,"Nilan CT300LR","Loft",100,400,20.933333333333334,null,null,"pro_11 - gennemsnit",{"$f":"AVERAGEIF(Table1[Producent], \"pro_11\",Table1[Kanallængde pr. kvdm])","v":0.34794630798400084},null,null,"pro_11 - gennemsnit",{"$f":"AVERAGEIF(Table1[Producent], \"pro_11\",Table1[Gulvvarme m/m2])","v":4.349774040237703},null,"pro_11 - gennemsnit",{"$f":"AVERAGEIF(Table1[Producent], \"pro_11\",Table1[Gulvvarme kg])","v":34.212500000000006}]
[null,"Type 3 - Bygning 5","pro_12","1 plans","Fladt",{"$f":"IF(Table1[[#This Row],[Type]]=\"1 plans\",1,IF(Table1[[#This Row],[Type]]=\"2 plans\",2,0))","v":1},{"$f":"IF(Table1[[#This Row],[Tag]]=\"Ensidig hældning\",2,IF(Table1[[#This Row],[Tag]]=\"Fladt\",3,IF(Table1[[#This Row],[Tag]]=\"Sadel\",1,0)))","v":3},6,185,{"$f":"8.6+11+11+6.5+7.9+4.5+11+3.5+38.9+23.3+10.2+7.9+6.7","v":151},{"$f":"IF(Table1[[#This Row],[Netto]]=\" \",\" \",Table1[[#This Row],[Brutto]]/Table1[[#This Row],[Netto]])","v":1.2251655629139073},{"$f":"(AC8+AD8+Table1[[#This Row],[Kanal - Indtag/afkast]])/I8","v":0.29777027027027025},2.5499999999999998,{"$f":"Table1[[#This Row],[Emhætte - kanallængde]]+Table1[[#This Row],[Kanal - Ind]]+Table1[[#This Row],[Kanal - Ud]]+Table1[[#This Row],[Kanal - Indtag/afkast]]","v":55.087499999999999},22,"Ja",300,{"$f":"23.7+31.7+40.3+46.7+109.7+83.5+62.3+88.8+100.3+55.7+33+52.7+30.7","v":759.10000000000014},{"$f":"Table1[[#This Row],[Gulvvarme længde]]/Table1[[#This Row],[Netto]]","v":5.0271523178807955},{"$f":"IF(Table1[[#This Row],[Gulvvarme - c.afstand]]=200,(Table1[[#This Row],[Gulvvarme længde]]*Gulvvarme!J$9),IF(Table1[[#This Row],[Gulvvarme - c.afstand]]=250,Table1[[#This Row],[Gulvvarme længde]]*Gulvvarme!J$8,Table1[[#This Row],[Gulvvarme længde]]*Gulvvarme!J$10))","v":88.814700000000016},{"$f":"Table1[[#This Row],[Gulvvarme kg]]/Table1[[#This Row],[Netto]]","v":0.58817682119205306},{"$f":"IF(Table1[[#This Row],[Gulvvarme - c.afstand]]=250,Table1[[#This Row],[Gulvvarme længde]]/Gulvvarme!I$8,IF(Table1[[#This Row],[Gulvvarme - c.afstand]]=300,Table1[[#This Row],[Gulvvarme længde]]/Gulvvarme!I$10,\"\"))","v":230.03030303030309},{"$f":"Table1[[#This Row],[Gulvvarme m2]]/Table1[[#This Row],[Netto]]","v":1.5233794902669078},13,6,5,0,0,{"$f":"((900)+550+550+550+(900+1300+800)+(600+1610+4860)+(800+1920+200+500)+800+200+(3500)+3250)/1000","v":23.79},{"$f":"((1800)+(17.5*453)+(22*453)+(950)+(8.5*453)+(9.5*453))/1000","v":28.797499999999999},2.5,"Nilan CT300LR","Loft",100,400,25.166666666666668,null,null,"pro_13 - gennemsnit",{"$f":"AVERAGEIF(Table1[Producent], \"pro_13\",Table1[Kanallængde pr. kvdm])","v":0.32635881939370948},null,null,"1-plan - gennemsnit",{"$f":"AVERAGEIF(Table1[Type], \"1 plans\",Table1[Gulvvarme m/m2])","v":2.232089592130289},null,"1-plan - gennemsnit",{"$f":"AVERAGEIF(Table1[Type], \"1 plans\",Table1[Gulvvarme kg])","v":31.470000000000002}]
[null,"Bygning 1 ","pro_13","1 plans","Fladt",{"$f":"IF(Table1[[#This Row],[Type]]=\"1 plans\",1,IF(Table1[[#This Row],[Type]]=\"2 plans\",2,0))","v":1},{"$f":"IF(Table1[[#This Row],[Tag]]=\"Ensidig hældning\",2,IF(Table1[[#This Row],[Tag]]=\"Fladt\",3,IF(Table1[[#This Row],[Tag]]=\"Sadel\",1,0)))","v":3},6,180,145,{"$f":"IF(Table1[[#This Row],[Netto]]=\" \",\" \",Table1[[#This Row],[Brutto]]/Table1[[#This Row],[Netto]])","v":1.2413793103448276},{"$f":"(AC9+AD9+Table1[[#This Row],[Kanal - Indtag/afkast]])/I9","v":0.35833333333333334},2.5,{"$f":"Table1[[#This Row],[Emhætte - kanallængde]]+Table1[[#This Row],[Kanal - Ind]]+Table1[[#This Row],[Kanal - Ud]]+Table1[[#This Row],[Kanal - Indtag/afkast]]","v":66},22,"Ja",null,null,{"$f":"Table1[[#This Row],[Gulvvarme længde]]/Table1[[#This Row],[Netto]]","v":0},{"$f":"IF(Table1[[#This Row],[Gulvvarme - c.afstand]]=200,(Table1[[#This Row],[Gulvvarme længde]]*Gulvvarme!J$9),IF(Table1[[#This Row],[Gulvvarme - c.afstand]]=250,Table1[[#This Row],[Gulvvarme længde]]*Gulvvarme!J$8,Table1[[#This Row],[Gulvvarme længde]]*Gulvvarme!J$10))","v":0},{"$f":"Table1[[#This Row],[Gulvvarme kg]]/Table1[[#This Row],[Netto]]","v":0},{"$f":"IF(Table1[[#This Row],[Gulvvarme - c.afstand]]=250,Table1[[#This Row],[Gulvvarme længde]]/Gulvvarme!I$8,IF(Table1[[#This Row],[Gulvvarme - c.afstand]]=300,Table1[[#This Row],[Gulvvarme længde]]/Gulvvarme!I$10,\"\"))","v":""},{"$f":"Table1[[#This Row],[Gulvvarme m2]]/Table1[[#This Row],[Netto]]","v":{"$error":"#VALUE!"}},null,6,4,1,1.5,27.5,31.5,5.5,"Dantherm HCV400P2","Skab",70,290,24.166666666666668,null,null,"pro_14 - gennemsnit",{"$f":"AVERAGEIF(Table1[Producent], \"pro_14\",Table1[Kanallængde pr. kvdm])","v":0.34775887188507937},null,null,"2-plan - gennemsnit",{"$f":"AVERAGEIF(Table1[Type], \"2 plans\",Table1[Gulvvarme m/m2])","v":3.2866169336757571},null,"2-plan - gennemsnit",{"$f":"AVERAGEIF(Table1[Type], \"2 plans\",Table1[Gulvvarme kg])","v":42.25}]
[null,"Bygning 4","pro_13","1 plans","Fladt",{"$f":"IF(Table1[[#This Row],[Type]]=\"1 plans\",1,IF(Table1[[#This Row],[Type]]=\"2 plans\",2,0))","v":1},{"$f":"IF(Table1[[#This Row],[Tag]]=\"Ensidig hældning\",2,IF(Table1[[#This Row],[Tag]]=\"Fladt\",3,IF(Table1[[#This Row],[Tag]]=\"Sadel\",1,0)))","v":3},6,160,154.1,{"$f":"IF(Table1[[#This Row],[Netto]]=\" \",\" \",Table1[[#This Row],[Brutto]]/Table1[[#This Row],[Netto]])","v":1.0382868267358858},{"$f":"(AC10+AD10+Table1[[#This Row],[Kanal - Indtag/afkast]])/I10","v":0.4},2.41,{"$f":"Table1[[#This Row],[Emhætte - kanallængde]]+Table1[[#This Row],[Kanal - Ind]]+Table1[[#This Row],[Kanal - Ud]]+Table1[[#This Row],[Kanal - Indtag/afkast]]","v":66},22,"Ja",null,null,{"$f":"Table1[[#This Row],[Gulvvarme længde]]/Table1[[#This Row],[Netto]]","v":0},{"$f":"IF(Table1[[#This Row],[Gulvvarme - c.afstand]]=200,(Table1[[#This Row],[Gulvvarme længde]]*Gulvvarme!J$9),IF(Table1[[#This Row],[Gulvvarme - c.afstand]]=250,Table1[[#This Row],[Gulvvarme længde]]*Gulvvarme!J$8,Table1[[#This Row],[Gulvvarme længde]]*Gulvvarme!J$10))","v":0},{"$f":"Table1[[#This Row],[Gulvvarme kg]]/Table1[[#This Row],[Netto]]","v":0},{"$f":"IF(Table1[[#This Row],[Gulvvarme - c.afstand]]=250,Table1[[#This Row],[Gulvvarme længde]]/Gulvvarme!I$8,IF(Table1[[#This Row],[Gulvvarme - c.afstand]]=300,Table1[[#This Row],[Gulvvarme længde]]/Gulvvarme!I$10,\"\"))","v":""},{"$f":"Table1[[#This Row],[Gulvvarme m2]]/Table1[[#This Row],[Netto]]","v":{"$error":"#VALUE!"}},null,5,4,1,2,31.5,27,5.5,"Dantherm HCV400P2","Skab",70,290,25.683333333333334]
{"$rows_left_out":101}
{"sheet":"Regression","index":7,"n_rows":30,"n_cols":20,"rows_kept":30,"cut":false,"hidden":true,"merged":[]}
["SUMMARY OUTPUT"]
[]
["Regression Statistics"]
["Multiple R",0.80706772627625534]
["R Square",0.65135831479672457]
["Adjusted R Square",0.55451340224025925]
["Standard Error",7.6895633101014074]
["Observations",24]
[]
["ANOVA"]
{"$rows_left_out":21}
{"sheet":"Regression - bøjninger","index":8,"n_rows":22,"n_cols":9,"rows_kept":22,"cut":false,"hidden":true,"merged":[]}
["SUMMARY OUTPUT"]
[]
["Regression Statistics"]
["Multiple R",0.68016435316418578]
["R Square",0.46262354731525523]
["Adjusted R Square",0.31335231045838163]
["Standard Error",1.6387917306509441]
["Observations",24]
[]
["ANOVA"]
{"$rows_left_out":13}
{"sheet":"Drop-down","index":9,"n_rows":12,"n_cols":5,"rows_kept":12,"cut":false,"hidden":true,"merged":[]}
["Hustype","Antal","Værelser","Tagtype","Bool"]
["1-plan",0,0,"Sadeltag","Ja"]
["2-plan",1,1,"Fladt tag","Nej"]
[null,2,2,"Ensidig hældning"]
[null,3,3]
[null,4,4]
[null,5,5]
[null,6,6]
[null,7,7]
[null,8,8]
{"$rows_left_out":2}