{"text_format":"1","workbook":"xlsx","n_sheets":6,"sheets":["Hovedside","Stinkskabe, LAF-bænke","Ventilatorer","Besparelsespotentialer","Sikkerhedsfaktor","Ventilator_EHH"],"not_rendered":{"charts":0,"images":3,"macros":1,"external_links":0,"defined_names":7,"comments":0,"pivot_tables":0},"unopened":[],"bounds":{"document_bytes":16777216,"sheet_cells":100000,"rows_first":2000,"rows_last":500,"rows_between":2000,"halvings":0,"cell_chars":16384,"cell_head_chars":4096},"cells_cut":0,"cells_raw":0,"read":"row_number_cap","date_system":"1900"}

{"sheet":"Hovedside","index":0,"n_rows":38,"n_cols":10,"rows_kept":38,"cut":false,"hidden":false,"merged":[[37,0,41,10],[2,0,9,7],[10,1,10,4],[11,1,11,4],[10,9,10,10],[15,4,15,8],[13,8,14,10],[13,1,13,2]]}
[]
["Introduktion til brug af energibesparelsesværktøj RELS"]
["Værktøjet benyttes til at undersøge energibesparelsespotentialet til laboratorieventilation. Ved at foretage målinger og registreringer af en eksisterende situation kan værktøjet beregne besparelsespotentialer for ventilator, stinkskabe, Laf-bænke m.m.                                                                                                             For yderligere information om værktøjets brug kan vejledningen læses ved tryk på den røde bog   →"]
[]
[]
[]
[]
[]
[]
[]
["Navn:","Morten Jakobsen",null,null,null,null,null,null,"Dato:","2016-08-01"]
["Projektnr.:","123-456"]
[]
["Investering:",17500,null,null,"Varmepris:",600,"[kr./MWh]",null,"NB! Alle priser oplyses eksl. moms"]
["Tilskudspris:",0.3,"[kr./kWh]",null,"Elpris:",2,"[kr./kWh]"]
[null,null,null,null,"Energiforbrug"]
[null,null,null,null,"Før",null,null,"Efter"]
[null,null,null,null,11615.89248,"[kWh/år]",null,5917.2767999999996,"[kWh/år]"]
[null,null,null,null,534.29376000000002,"[kWh/år]",null,366.03839999999997,"[kWh/år]"]
[]
[]
["Samlet varmeforbrug",null,null,null,{"$f":"IF(E18=\"\",\"\",E18)","v":11615.89248},"[kWh/år]",null,{"$f":"IF(H18=\"\",\"\",H18)","v":5917.2767999999996},"[kWh/år]"]
["Samlet elforbrug",null,null,null,{"$f":"IF(E19=\"\",\"\",E19)","v":534.29376000000002},"[kWh/år]",null,{"$f":"IF(H19=\"\",\"\",H19)","v":366.03839999999997},"[kWh/år]"]
[]
["Procentvis reduktion af varmeforbrug",null,null,null,null,null,null,{"$f":"IF(OR(E22=0,E22=\"\"),\"\",1-H22/E22)","v":0.49058784676354039}]
["Procentvis reduktion af elforbrug",null,null,null,null,null,null,{"$f":"IF(OR(E23=0,E23=\"\"),\"\",1-H23/E23)","v":0.31491170699803805}]
[]
["Årlig varmebesparelse",null,null,null,null,null,null,{"$f":"IF(E22=\"\",\"\",E22-H22)","v":5698.6156800000008},"[kWh/år]"]
["Årlig elbesparelse",null,null,null,null,null,null,{"$f":"IF(E23=\"\",\"\",E23-H23)","v":168.25536000000005},"[kWh/år]"]
["Årlig økonomisk energibesparelse, eksl. moms",null,null,null,null,null,null,{"$f":"IF(OR(H28=\"\",H29=\"\"),\"\",H28*F14/1000+H29*F15)","v":3755.6801280000004},"[kr./år]"]
["Salg af energibesparelse, eksl. moms",null,null,null,null,null,null,{"$f":"IF(OR(H28=\"\",H29=\"\"),\"\",(H28+H29)*B15)","v":1760.0613120000003},"[kr.]"]
[]
["Tilbagebetalingstid",null,null,null,null,null,null,{"$f":"IF(OR(B14=0,B14=\"\",H30=0,H30=\"\",H31=\"\"),\"\",(B14-H31)/H30)","v":4.1909689194915369},"[år]"]
[]
[]
[]
["Kommentarer:"]
["Skriv kommentar…"]

{"sheet":"Stinkskabe, LAF-bænke","index":1,"n_rows":256,"n_cols":37,"rows_kept":256,"cut":false,"hidden":true,"merged":[[153,25,153,27],[27,4,27,5],[27,7,27,8],[153,3,153,5],[153,0,153,2],[153,22,153,24],[27,15,29,15],[27,13,29,14],[11,8,15,13]],"read":"row_number_cap"}
["Stinkskabe, LAF-bænke"]
[]
[null,null,"Målt",null,"Oplyst",null,null,"Beregnet"]
["Signatur:"]
[]
[]
[]
[]
[]
[]
[]
["Antal stinkskabe",null,null,null,5,"stk.",null,null,"Guide til målinger og registreringer til bestemmelse af stinkskabes varmeforbrug - Læs guide ved tryk på billedikonet til højre for teksten   →"]
[]
["Driftstimer pr. dag",null,null,null,10,"timer pr. dag",null,null,null,null,null,null,null,null,null,null,null,1,"Ja",1,"Ja",null,1,"Ja",null,1,"0,5 m",null,1,"Ja"]
["Antal dage om ugen",null,null,null,7,"dage pr. uge",null,null,null,null,null,null,null,null,null,null,null,2,"Nej",2,"Nej",null,2,"Nej",null,2,"1,0 m",null,2,"Nej"]
[null,null,null,null,null,null,null,null,null,null,null,null,null,null,null,null,null,null,null,null,null,null,null,null,null,3,"1,5 m"]
[null,null,null,null,null,null,null,null,null,null,null,null,null,null,null,null,null,{"$f":"INDEX(R14:R15,MATCH(E22,S14:S15,0))","v":1},null,{"$f":"INDEX(T14:T15,MATCH(E23,U14:U15,0))","v":2},null,null,{"$f":"INDEX(W14:W15,MATCH(E24,X14:X15,0))","v":1},null,null,{"$f":"INDEX(Z14:Z16,MATCH(E25,AA14:AA16,0))","v":1},null,null,{"$f":"INDEX(AC14:AC15,MATCH(E26,AD14:AD15,0))","v":2}]
["Skønnet tid hvor stinkskabene er fuldt åbne",null,null,null,0.3,null,null,null,null,null,null,null,null,null,null,"Guide"]
["Skønnet tid hvor stinkskabene er lukket",null,null,null,{"$f":"1-E18","v":0.7}]
[]
[]
["Er der VGV ved alle stinkskabe",null,null,null,"Ja","       Tryk på celle E22 for at benytte rullemenu"]
["Er der automatisk luge-luk styring på alle stinkskabene",null,null,null,"Nej","       Tryk på celle E23 for at benytte rullemenu"]
["Arbejdes der med sundhedsfarlige stoffer",null,null,null,"Ja","       Tryk på celle E24 for at benytte rullemenu"]
["Gangliniens afstand fra stinkskabe",null,null,null,"0,5 m","       Tryk på celle E25 for at benytte rullemenu"]
["Ønskes der i stinkskabet installeret sugearm i fremtiden",null,null,null,"Nej","       Tryk på celle E26 for at benytte rullemenu"]
[]
["Aggregat",null,null,null,"Fuldt åbent",null,null,"Lukket i arbejdstiden",null,"Lukket udenfor arbejdstiden",null,null,null,"Automatisk luge-luk styring",null,"Sundheds-    skadelige stoffer"]
["Anlægsnr.","Stinkskabsnr.",null,"Stinkskabsbredde","Lugeåbning","Lufthastighed",null,"Lugeåbning","Lufthastighed","Lufthastighed",null,"Tryk*","VGV"]
[null,null,null,"[m]","[cm]","[m/s]",null,"[cm]","[m/s]","[m/s]",null,"[Pa]"]
["VE01",1,null,1,50,0.5,null,12,0.3,0.3,null,110,"Ja","Nej",null,"Ja"]
["VE01",2,null,1,50,0.5,null,12,0.3,0.3,null,110,"Ja","Nej",null,"Ja"]
["VE01",3,null,1,50,0.5,null,12,0.3,0.3,null,110,"Ja","Nej",null,"Ja"]
["ve01",4,null,1,50,0.5,null,12,0.3,0.3,null,110,"Ja","Nej",null,"Ja"]
["ve01",5,null,1,50,0.5,null,12,0.3,0.3,null,110,"Ja","Nej",null,"Ja"]
[null,6,null,null,null,null,null,null,null,null,null,null,null,"Nej",null,"Ja"]
[null,7,null,null,null,null,null,null,null,null,null,null,null,"Nej",null,"Ja"]
[null,8,null,null,null,null,null,null,null,null,null,null,null,"Nej",null,"Ja"]
[null,9,null,null,null,null,null,null,null,null,null,null,null,"Nej",null,"Ja"]
[null,10,null,null,null,null,null,null,null,null,null,null,null,"Nej",null,"Ja"]
[null,11,null,null,null,null,null,null,null,null,null,null,null,"Nej",null,"Ja"]
[null,12,null,null,null,null,null,null,null,null,null,null,null,"Nej",null,"Ja"]
[null,13,null,null,null,null,null,null,null,null,null,null,null,"Nej",null,"Ja"]
[null,14,null,null,null,null,null,null,null,null,null,null,null,"Nej",null,"Ja"]
[null,15,null,null,null,null,null,null,null,null,null,null,null,"Nej",null,"Ja"]
[null,16,null,null,null,null,null,null,null,null,null,null,null,"Nej",null,"Ja"]
[null,17,null,null,null,null,null,null,null,null,null,null,null,"Nej",null,"Ja"]
[null,18,null,null,null,null,null,null,null,null,null,null,null,"Nej",null,"Ja"]
[null,19,null,null,null,null,null,null,null,null,null,null,null,"Nej",null,"Ja"]
[null,20,null,null,null,null,null,null,null,null,null,null,null,"Nej",null,"Ja"]
[null,21,null,null,null,null,null,null,null,null,null,null,null,"Nej",null,"Ja"]
[null,22,null,null,null,null,null,null,null,null,null,null,null,"Nej",null,"Ja"]
[null,23,null,null,null,null,null,null,null,null,null,null,null,"Nej",null,"Ja"]
[null,24,null,null,null,null,null,null,null,null,null,null,null,"Nej",null,"Ja"]
[null,25,null,null,null,null,null,null,null,null,null,null,null,"Nej",null,"Ja"]
[null,26,null,null,null,null,null,null,null,null,null,null,null,"Nej",null,"Ja"]
[null,27,null,null,null,null,null,null,null,null,null,null,null,"Nej",null,"Ja"]
[null,28,null,null,null,null,null,null,null,null,null,null,null,"Nej",null,"Ja"]
[null,29,null,null,null,null,null,null,null,null,null,null,null,"Nej",null,"Ja"]
[null,30,null,null,null,null,null,null,null,null,null,null,null,"Nej",null,"Ja"]
[null,31,null,null,null,null,null,null,null,null,null,null,null,"Nej",null,"Ja"]
[null,32,null,null,null,null,null,null,null,null,null,null,null,"Nej",null,"Ja"]
[null,33,null,null,null,null,null,null,null,null,null,null,null,"Nej",null,"Ja"]
[null,34,null,null,null,null,null,null,null,null,null,null,null,"Nej",null,"Ja"]
[null,35,null,null,null,null,null,null,null,null,null,null,null,"Nej",null,"Ja"]
[null,36,null,null,null,null,null,null,null,null,null,null,null,"Nej",null,"Ja"]
[null,37,null,null,null,null,null,null,null,null,null,null,null,"Nej",null,"Ja"]
[null,38,null,null,null,null,null,null,null,null,null,null,null,"Nej",null,"Ja"]
[null,39,null,null,null,null,null,null,null,null,null,null,null,"Nej",null,"Ja"]
[null,40,null,null,null,null,null,null,null,null,null,null,null,"Nej",null,"Ja"]
[null,41,null,null,null,null,null,null,null,null,null,null,null,"Nej",null,"Ja"]
[null,42,null,null,null,null,null,null,null,null,null,null,null,"Nej",null,"Ja"]
[null,43,null,null,null,null,null,null,null,null,null,null,null,"Nej",null,"Ja"]
[null,44,null,null,null,null,null,null,null,null,null,null,null,"Nej",null,"Ja"]
[null,45,null,null,null,null,null,null,null,null,null,null,null,"Nej",null,"Ja"]
[null,46,null,null,null,null,null,null,null,null,null,null,null,"Nej",null,"Ja"]
[null,47,null,null,null,null,null,null,null,null,null,null,null,"Nej",null,"Ja"]
[null,48,null,null,null,null,null,null,null,null,null,null,null,"Nej",null,"Ja"]
[null,49,null,null,null,null,null,null,null,null,null,null,null,"Nej",null,"Ja"]
[null,50,null,null,null,null,null,null,null,null,null,null,null,"Nej",null,"Ja"]
[null,51,null,null,null,null,null,null,null,null,null,null,null,"Nej",null,"Ja"]
[null,52,null,null,null,null,null,null,null,null,null,null,null,"Nej",null,"Ja"]
[null,53,null,null,null,null,null,null,null,null,null,null,null,"Nej",null,"Ja"]
[null,54,null,null,null,null,null,null,null,null,null,null,null,"Nej",null,"Ja"]
[null,55,null,null,null,null,null,null,null,null,null,null,null,"Nej",null,"Ja"]
[null,56,null,null,null,null,null,null,null,null,null,null,null,"Nej",null,"Ja"]
[null,57,null,null,null,null,null,null,null,null,null,null,null,"Nej",null,"Ja"]
[null,58,null,null,null,null,null,null,null,null,null,null,null,"Nej",null,"Ja"]
[null,59,null,null,null,null,null,null,null,null,null,null,null,"Nej",null,"Ja"]
[null,60,null,null,null,null,null,null,null,null,null,null,null,"Nej",null,"Ja"]
[null,61,null,null,null,null,null,null,null,null,null,null,null,"Nej",null,"Ja"]
[null,62,null,null,null,null,null,null,null,null,null,null,null,"Nej",null,"Ja"]
[null,63,null,null,null,null,null,null,null,null,null,null,null,"Nej",null,"Ja"]
[null,64,null,null,null,null,null,null,null,null,null,null,null,"Nej",null,"Ja"]
[null,65,null,null,null,null,null,null,null,null,null,null,null,"Nej",null,"Ja"]
[null,66,null,null,null,null,null,null,null,null,null,null,null,"Nej",null,"Ja"]
[null,67,null,null,null,null,null,null,null,null,null,null,null,"Nej",null,"Ja"]
[null,68,null,null,null,null,null,null,null,null,null,null,null,"Nej",null,"Ja"]
[null,69,null,null,null,null,null,null,null,null,null,null,null,"Nej",null,"Ja"]
[null,70,null,null,null,null,null,null,null,null,null,null,null,"Nej",null,"Ja"]
[null,71,null,null,null,null,null,null,null,null,null,null,null,"Nej",null,"Ja"]
[null,72,null,null,null,null,null,null,null,null,null,null,null,"Nej",null,"Ja"]
[null,73,null,null,null,null,null,null,null,null,null,null,null,"Nej",null,"Ja"]
[null,74,null,null,null,null,null,null,null,null,null,null,null,"Nej",null,"Ja"]
[null,75,null,null,null,null,null,null,null,null,null,null,null,"Nej",null,"Ja"]
[null,76,null,null,null,null,null,null,null,null,null,null,null,"Nej",null,"Ja"]
[null,77,null,null,null,null,null,null,null,null,null,null,null,"Nej",null,"Ja"]
[null,78,null,null,null,null,null,null,null,null,null,null,null,"Nej",null,"Ja"]
[null,79,null,null,null,null,null,null,null,null,null,null,null,"Nej",null,"Ja"]
[null,80,null,null,null,null,null,null,null,null,null,null,null,"Nej",null,"Ja"]
[null,81,null,null,null,null,null,null,null,null,null,null,null,"Nej",null,"Ja"]
[null,82,null,null,null,null,null,null,null,null,null,null,null,"Nej",null,"Ja"]
[null,83,null,null,null,null,null,null,null,null,null,null,null,"Nej",null,"Ja"]
[null,84,null,null,null,null,null,null,null,null,null,null,null,"Nej",null,"Ja"]
[null,85,null,null,null,null,null,null,null,null,null,null,null,"Nej",null,"Ja"]
[null,86,null,null,null,null,null,null,null,null,null,null,null,"Nej",null,"Ja"]
[null,87,null,null,null,null,null,null,null,null,null,null,null,"Nej",null,"Ja"]
[null,88,null,null,null,null,null,null,null,null,null,null,null,"Nej",null,"Ja"]
[null,89,null,null,null,null,null,null,null,null,null,null,null,"Nej",null,"Ja"]
[null,90,null,null,null,null,null,null,null,null,null,null,null,"Nej",null,"Ja"]
[null,91,null,null,null,null,null,null,null,null,null,null,null,"Nej",null,"Ja"]
[null,92,null,null,null,null,null,null,null,null,null,null,null,"Nej",null,"Ja"]
[null,93,null,null,null,null,null,null,null,null,null,null,null,"Nej",null,"Ja"]
[null,94,null,null,null,null,null,null,null,null,null,null,null,"Nej",null,"Ja"]
[null,95,null,null,null,null,null,null,null,null,null,null,null,"Nej",null,"Ja"]
[null,96,null,null,null,null,null,null,null,null,null,null,null,"Nej",null,"Ja"]
[null,97,null,null,null,null,null,null,null,null,null,null,null,"Nej",null,"Ja"]
[null,98,null,null,null,null,null,null,null,null,null,null,null,"Nej",null,"Ja"]
[null,99,null,null,null,null,null,null,null,null,null,null,null,"Nej",null,"Ja"]
[null,100,null,null,null,null,null,null,null,null,null,null,null,"Nej",null,"Ja"]
[null,null,null,null,null,null,null,null,null,null,null,null,null,"Nej",null,"Ja"]
[]
[]
["*Tryk måles umiddelbart efter stinkskabet og før et evt. spjæld"]
[]
[]
[]
[null,null,null,null,null,null,null,null,null,null,null,null,null,null,null,null,null,null,null,null,null,null,null,"Stinkskabe, LAF-bænke mm"]
[]
[]
[]
[]
[null,null,null,null,null,null,null,null,null,null,null,null,null,null,null,null,null,null,null,null,null,null,null,"Ved et tryk på over 40 Pa over stinkskabet foreslås en reducering af trykket til 40 Pa"]
[]
["Område skjules"]
[]
[null,null,null,null,null,null,null,null,null,null,null,null,null,"Funktion nedenfor",null,null,"Funktion nedenfor","Funktion nedenfor",null,null,null,null,null,null,null,"Funktion nedenfor","Funktion nedenfor"]
[]
[]
["FØR",null,null,null,null,null,null,null,"EFTER"]
[]
[null,null,null,null,null,null,null,null,null,null,null,null,"Fuldt åbent",null,null,"Lukket i arbejdstiden",null,"Lukket udenfor arbejdstiden"]
["Luftmængde åbent","Luftmængde lukket","Luftmængde uden for arbejdstiden","Energiforbrug",null,null,"Energiforbrug",null,"Lab.nr/navn","Stinkskabs nr.",null,"Stinkskabsbredde","Lugeåbning","Lufthastighed",null,"Lugeåbning","Lufthastighed","Lufthastighed",null,"Tryk*","VGV",null,"Luftmængde åbent","Luftmængde lukket","Luftmængde uden for arbejdstiden","Energiforbrug",null,null,"Energiforbrug",null,"Check for aggregatnavne"]
["[m3/h]",null,null,"[kWh/år]",null,null,"[kWh/år]",null,null,null,null,"[m]","[cm]","[m/s]",null,"[cm]","[m/s]","[m/s]",null,"[Pa]",null,null,"[m3/h]",null,null,"[kWh/år]",null,null,"[kWh/år]",null,null,null,null,null,null,"antal aggregater","antal celler uden indtastning"]
[{"$f":"IF(B31=\"\",\"\",D31*E31*F31/100*3600)","v":900},{"$f":"IF($B31=\"\",\"\",$D31*$H31*I31/100*3600)","v":129.6},129.6,{"$f":"IF(B31=\"\",\"\",0.005*A155*(IF($E$14>=8,8,$E$14))*$E$15*4*12*$E$18*(1-IF($M31=\"ja\",0.63,0)))","v":1342.6559999999999},{"$f":"IF(B31=\"\",\"\",0.005*B155*(IF($E$14>=8,8,$E$14))*$E$15*4*12*$E$19*(1-IF($M31=\"ja\",0.63,0)))","v":451.13241599999992},{"$f":"IF(B31=\"\",\"\",IF($E$15<=5,0.005*C155*($E$14-8)*$E$15*4*12*(1-IF($M31=\"ja\",0.63,0)),0.005*C155*(($E$14-8)*$E$15+($E$15-5)*16)*4*12*(1-IF($M31=\"ja\",0.63,0))))","v":529.39008000000001},{"$f":"IF(H155=0,\"\",D155+E155+F155)","v":2323.178496},{"$f":"IF(B31<=$E$12,1,0)","v":1},{"$f":"IF(A31=\"\",\"\",A31)","v":"VE01"},{"$f":"B31","v":1},null,{"$f":"D31","v":1},50,{"$f":"IF(AND($E$24=\"Nej\",OR(E25=$AA$16,$E$26=\"Ja\")),IF(F31>=0.4,0.4,F31),F31)","v":0.5},null,{"$f":"IF(H31>5,5,H31)","v":5},{"$f":"IF(I31>=0.3,0.3,I31)","v":0.3},{"$f":"IF(J31>=0.1,0.1,J31)","v":0.1},null,{"$f":"L31","v":110},"Ja",null,{"$f":"IF(J155=\"\",\"\",L155*M155*N155/100*3600)","v":900},{"$f":"IF(J155=\"\",\"\",L155*P155*Q155/100*3600)","v":54},{"$f":"IF(J155=\"\",\"\",L155*P155*R155/100*3600)","v":18},{"$f":"IF(J155=\"\",\"\",0.005*W155*(IF($E$14>=8,8,$E$14))*$E$15*4*12*IF(N31=\"Nej\",$E$18-10%,$E$18)*(1-IF(U155=\"ja\",0.63,0)))","v":895.10399999999993},{"$f":"IF(J155=\"\",\"\",0.005*X155*(IF($E$14>=8,8,$E$14))*$E$15*4*12*IF(N31=\"Nej\",$E$19+10%,$E$19)*(1-IF(U155=\"ja\",0.63,0)))","v":214.82495999999998},{"$f":"IF(J155=\"\",\"\",IF($E$15<=5,0.005*Y155*($E$14-8)*$E$15*4*12*(1-IF(U155=\"ja\",0.63,0)),0.005*Y155*(($E$14-8)*$E$15+($E$15-5)*16)*4*12*(1-IF($M31=\"ja\",0.63,0))))","v":73.526399999999981},{"$f":"IF(AD155=0,\"\",Z155+AA155+AB155)","v":1183.4553599999999},{"$f":"IF(B31<=$E$12,1,0)","v":1},1,{"$f":"SUM(IF(AE155:AE163=1,W155:W163))","v":4500},null,null,null,{"$f":"SUMPRODUCT(1/COUNTIF(AE155:AE254,AE155:AE254))+IF(AK156>0,-1,0)","v":1.0000000000000031}]
[{"$f":"IF(B32=\"\",\"\",D32*E32*F32/100*3600)","v":900},129.6,129.6,{"$f":"IF(B32=\"\",\"\",0.005*A156*(IF($E$14>=8,8,$E$14))*$E$15*4*12*$E$18*(1-IF($M32=\"ja\",0.63,0)))","v":1342.6559999999999},{"$f":"IF(B32=\"\",\"\",0.005*B156*(IF($E$14>=8,8,$E$14))*$E$15*4*12*$E$19*(1-IF($M32=\"ja\",0.63,0)))","v":451.13241599999992},{"$f":"IF(B32=\"\",\"\",IF($E$15<=5,0.005*C156*($E$14-8)*$E$15*4*12*(1-IF($M32=\"ja\",0.63,0)),0.005*C156*(($E$14-8)*$E$15+($E$15-5)*16)*4*12*(1-IF($M32=\"ja\",0.63,0))))","v":529.39008000000001},{"$f":"IF(H156=0,\"\",D156+E156+F156)","v":2323.178496},{"$f":"IF(B32<=$E$12,1,0)","v":1},{"$f":"IF(A32=\"\",\"\",A32)","v":"VE01"},{"$f":"B32","v":2},null,1,50,{"$f":"IF(AND($E$24=\"Nej\",OR(E26=$AA$16,$E$26=\"Ja\")),IF(F32>=0.4,0.4,F32),F32)","v":0.5},null,{"$f":"IF(H32>5,5,H32)","v":5},{"$f":"IF(I32>=0.3,0.3,I32)","v":0.3},{"$f":"IF(J32>=0.1,0.1,J32)","v":0.1},null,{"$f":"L32","v":110},"Ja",null,{"$f":"IF(J156=\"\",\"\",L156*M156*N156/100*3600)","v":900},{"$f":"IF(J156=\"\",\"\",L156*P156*Q156/100*3600)","v":54},{"$f":"IF(J156=\"\",\"\",L156*P156*R156/100*3600)","v":18},{"$f":"IF(J156=\"\",\"\",0.005*W156*(IF($E$14>=8,8,$E$14))*$E$15*4*12*IF(N32=\"Nej\",$E$18-10%,$E$18)*(1-IF(U156=\"ja\",0.63,0)))","v":895.10399999999993},{"$f":"IF(J156=\"\",\"\",0.005*X156*(IF($E$14>=8,8,$E$14))*$E$15*4*12*IF(N32=\"Nej\",$E$19+10%,$E$19)*(1-IF(U156=\"ja\",0.63,0)))","v":214.82495999999998},{"$f":"IF(J156=\"\",\"\",IF($E$15<=5,0.005*Y156*($E$14-8)*$E$15*4*12*(1-IF(U156=\"ja\",0.63,0)),0.005*Y156*(($E$14-8)*$E$15+($E$15-5)*16)*4*12*(1-IF($M32=\"ja\",0.63,0))))","v":73.526399999999981},{"$f":"IF(AD156=0,\"\",Z156+AA156+AB156)","v":1183.4553599999999},{"$f":"IF(B32<=$E$12,1,0)","v":1},{"$f":"IF(A32=\"\",0,IF(A32=A31,AE155,IF(A32<>A31,1+AE155)))","v":1},{"$f":"SUM(IF(AE155:AE163=2,W155:W163))","v":0},null,null,null,null,{"$f":"COUNTIF(AE155:AE254,\"=0\")","v":95}]
[{"$f":"IF(B33=\"\",\"\",D33*E33*F33/100*3600)","v":900},129.6,129.6,{"$f":"IF(B33=\"\",\"\",0.005*A157*(IF($E$14>=8,8,$E$14))*$E$15*4*12*$E$18*(1-IF($M33=\"ja\",0.63,0)))","v":1342.6559999999999},{"$f":"IF(B33=\"\",\"\",0.005*B157*(IF($E$14>=8,8,$E$14))*$E$15*4*12*$E$19*(1-IF($M33=\"ja\",0.63,0)))","v":451.13241599999992},{"$f":"IF(B33=\"\",\"\",IF($E$15<=5,0.005*C157*($E$14-8)*$E$15*4*12*(1-IF($M33=\"ja\",0.63,0)),0.005*C157*(($E$14-8)*$E$15+($E$15-5)*16)*4*12*(1-IF($M33=\"ja\",0.63,0))))","v":529.39008000000001},{"$f":"IF(H157=0,\"\",D157+E157+F157)","v":2323.178496},{"$f":"IF(B33<=$E$12,1,0)","v":1},{"$f":"IF(A33=\"\",\"\",A33)","v":"VE01"},{"$f":"B33","v":3},null,1,50,{"$f":"IF(AND($E$24=\"Nej\",OR(E27=$AA$16,$E$26=\"Ja\")),IF(F33>=0.4,0.4,F33),F33)","v":0.5},null,{"$f":"IF(H33>5,5,H33)","v":5},{"$f":"IF(I33>=0.3,0.3,I33)","v":0.3},{"$f":"IF(J33>=0.1,0.1,J33)","v":0.1},null,{"$f":"L33","v":110},"Ja",null,{"$f":"IF(J157=\"\",\"\",L157*M157*N157/100*3600)","v":900},{"$f":"IF(J157=\"\",\"\",L157*P157*Q157/100*3600)","v":54},{"$f":"IF(J157=\"\",\"\",L157*P157*R157/100*3600)","v":18},{"$f":"IF(J157=\"\",\"\",0.005*W157*(IF($E$14>=8,8,$E$14))*$E$15*4*12*IF(N33=\"Nej\",$E$18-10%,$E$18)*(1-IF(U157=\"ja\",0.63,0)))","v":895.10399999999993},{"$f":"IF(J157=\"\",\"\",0.005*X157*(IF($E$14>=8,8,$E$14))*$E$15*4*12*IF(N33=\"Nej\",$E$19+10%,$E$19)*(1-IF(U157=\"ja\",0.63,0)))","v":214.82495999999998},{"$f":"IF(J157=\"\",\"\",IF($E$15<=5,0.005*Y157*($E$14-8)*$E$15*4*12*(1-IF(U157=\"ja\",0.63,0)),0.005*Y157*(($E$14-8)*$E$15+($E$15-5)*16)*4*12*(1-IF($M33=\"ja\",0.63,0))))","v":73.526399999999981},{"$f":"IF(AD157=0,\"\",Z157+AA157+AB157)","v":1183.4553599999999},{"$f":"IF(B33<=$E$12,1,0)","v":1},{"$f":"IF(A33=\"\",0,IF(A33=A32,AE156,IF(A33<>A32,1+AE156)))","v":1},{"$f":"SUM(IF(AE155:AE163=3,W155:W163))","v":0}]
[{"$f":"IF(B34=\"\",\"\",D34*E34*F34/100*3600)","v":900},129.6,129.6,{"$f":"IF(B34=\"\",\"\",0.005*A158*(IF($E$14>=8,8,$E$14))*$E$15*4*12*$E$18*(1-IF($M34=\"ja\",0.63,0)))","v":1342.6559999999999},{"$f":"IF(B34=\"\",\"\",0.005*B158*(IF($E$14>=8,8,$E$14))*$E$15*4*12*$E$19*(1-IF($M34=\"ja\",0.63,0)))","v":451.13241599999992},{"$f":"IF(B34=\"\",\"\",IF($E$15<=5,0.005*C158*($E$14-8)*$E$15*4*12*(1-IF($M34=\"ja\",0.63,0)),0.005*C158*(($E$14-8)*$E$15+($E$15-5)*16)*4*12*(1-IF($M34=\"ja\",0.63,0))))","v":529.39008000000001},{"$f":"IF(H158=0,\"\",D158+E158+F158)","v":2323.178496},{"$f":"IF(B34<=$E$12,1,0)","v":1},{"$f":"IF(A34=\"\",\"\",A34)","v":"ve01"},{"$f":"B34","v":4},null,1,50,{"$f":"IF(AND($E$24=\"Nej\",OR(E28=$AA$16,$E$26=\"Ja\")),IF(F34>=0.4,0.4,F34),F34)","v":0.5},null,{"$f":"IF(H34>5,5,H34)","v":5},{"$f":"IF(I34>=0.3,0.3,I34)","v":0.3},{"$f":"IF(J34>=0.1,0.1,J34)","v":0.1},null,{"$f":"L34","v":110},"Ja",null,{"$f":"IF(J158=\"\",\"\",L158*M158*N158/100*3600)","v":900},{"$f":"IF(J158=\"\",\"\",L158*P158*Q158/100*3600)","v":54},{"$f":"IF(J158=\"\",\"\",L158*P158*R158/100*3600)","v":18},{"$f":"IF(J158=\"\",\"\",0.005*W158*(IF($E$14>=8,8,$E$14))*$E$15*4*12*IF(N34=\"Nej\",$E$18-10%,$E$18)*(1-IF(U158=\"ja\",0.63,0)))","v":895.10399999999993},{"$f":"IF(J158=\"\",\"\",0.005*X158*(IF($E$14>=8,8,$E$14))*$E$15*4*12*IF(N34=\"Nej\",$E$19+10%,$E$19)*(1-IF(U158=\"ja\",0.63,0)))","v":214.82495999999998},{"$f":"IF(J158=\"\",\"\",IF($E$15<=5,0.005*Y158*($E$14-8)*$E$15*4*12*(1-IF(U158=\"ja\",0.63,0)),0.005*Y158*(($E$14-8)*$E$15+($E$15-5)*16)*4*12*(1-IF($M34=\"ja\",0.63,0))))","v":73.526399999999981},{"$f":"IF(AD158=0,\"\",Z158+AA158+AB158)","v":1183.4553599999999},{"$f":"IF(B34<=$E$12,1,0)","v":1},{"$f":"IF(A34=\"\",0,IF(A34=A33,AE157,IF(A34<>A33,1+AE157)))","v":1}]
[{"$f":"IF(B35=\"\",\"\",D35*E35*F35/100*3600)","v":900},129.6,129.6,{"$f":"IF(B35=\"\",\"\",0.005*A159*(IF($E$14>=8,8,$E$14))*$E$15*4*12*$E$18*(1-IF($M35=\"ja\",0.63,0)))","v":1342.6559999999999},{"$f":"IF(B35=\"\",\"\",0.005*B159*(IF($E$14>=8,8,$E$14))*$E$15*4*12*$E$19*(1-IF($M35=\"ja\",0.63,0)))","v":451.13241599999992},{"$f":"IF(B35=\"\",\"\",IF($E$15<=5,0.005*C159*($E$14-8)*$E$15*4*12*(1-IF($M35=\"ja\",0.63,0)),0.005*C159*(($E$14-8)*$E$15+($E$15-5)*16)*4*12*(1-IF($M35=\"ja\",0.63,0))))","v":529.39008000000001},{"$f":"IF(H159=0,\"\",D159+E159+F159)","v":2323.178496},{"$f":"IF(B35<=$E$12,1,0)","v":1},{"$f":"IF(A35=\"\",\"\",A35)","v":"ve01"},{"$f":"B35","v":5},null,1,50,{"$f":"IF(AND($E$24=\"Nej\",OR(E29=$AA$16,$E$26=\"Ja\")),IF(F35>=0.4,0.4,F35),F35)","v":0.5},null,{"$f":"IF(H35>5,5,H35)","v":5},{"$f":"IF(I35>=0.3,0.3,I35)","v":0.3},{"$f":"IF(J35>=0.1,0.1,J35)","v":0.1},null,{"$f":"L35","v":110},"Ja",null,{"$f":"IF(J159=\"\",\"\",L159*M159*N159/100*3600)","v":900},{"$f":"IF(J159=\"\",\"\",L159*P159*Q159/100*3600)","v":54},{"$f":"IF(J159=\"\",\"\",L159*P159*R159/100*3600)","v":18},{"$f":"IF(J159=\"\",\"\",0.005*W159*(IF($E$14>=8,8,$E$14))*$E$15*4*12*IF(N35=\"Nej\",$E$18-10%,$E$18)*(1-IF(U159=\"ja\",0.63,0)))","v":895.10399999999993},{"$f":"IF(J159=\"\",\"\",0.005*X159*(IF($E$14>=8,8,$E$14))*$E$15*4*12*IF(N35=\"Nej\",$E$19+10%,$E$19)*(1-IF(U159=\"ja\",0.63,0)))","v":214.82495999999998},{"$f":"IF(J159=\"\",\"\",IF($E$15<=5,0.005*Y159*($E$14-8)*$E$15*4*12*(1-IF(U159=\"ja\",0.63,0)),0.005*Y159*(($E$14-8)*$E$15+($E$15-5)*16)*4*12*(1-IF($M35=\"ja\",0.63,0))))","v":73.526399999999981},{"$f":"IF(AD159=0,\"\",Z159+AA159+AB159)","v":1183.4553599999999},{"$f":"IF(B35<=$E$12,1,0)","v":1},{"$f":"IF(A35=\"\",0,IF(A35=A34,AE158,IF(A35<>A34,1+AE158)))","v":1}]
[{"$f":"IF(B36=\"\",0,D36*E36*F36/100*3600)","v":0},{"$f":"IF($B36=\"\",0,$D36*$H36*I36/100*3600)","v":0},{"$f":"IF($B36=\"\",0,$D36*$H36*J36/100*3600)","v":0},{"$f":"IF(B36=\"\",0,0.005*A160*(IF($E$14>=8,8,$E$14))*$E$15*4*12*$E$18*(1-IF($M36=\"ja\",0.63,0)))","v":0},{"$f":"IF(B36=\"\",0,0.005*B160*(IF($E$14>=8,8,$E$14))*$E$15*4*12*$E$19*(1-IF($M36=\"ja\",0.63,0)))","v":0},{"$f":"IF(B36=\"\",0,IF($E$15<=5,0.005*C160*($E$14-8)*$E$15*4*12*(1-IF($M36=\"ja\",0.63,0)),0.005*C160*(($E$14-8)*$E$15+($E$15-5)*16)*4*12*(1-IF($M36=\"ja\",0.63,0))))","v":0},{"$f":"IF(H160=0,\"\",D160+E160+F160)","v":""},{"$f":"IF(B36<=$E$12,1,0)","v":0},{"$f":"IF(A36=\"\",\"\",A36)","v":""},{"$f":"B36","v":6},null,{"$f":"D36","v":0},{"$f":"E36","v":0},{"$f":"IF(AND($E$24=\"Nej\",OR(E30=$AA$16,$E$26=\"Ja\")),IF(F36>=0.4,0.4,F36),F36)","v":0},null,{"$f":"IF(H36>5,5,H36)","v":0},{"$f":"IF(I36>=0.3,0.3,I36)","v":0},{"$f":"IF(J36>=0.1,0.1,J36)","v":0},null,{"$f":"L36","v":0},"Ja",null,{"$f":"IF(J160=\"\",\"\",L160*M160*N160/100*3600)","v":0},{"$f":"IF(J160=\"\",\"\",L160*P160*Q160/100*3600)","v":0},{"$f":"IF(J160=\"\",\"\",L160*P160*R160/100*3600)","v":0},{"$f":"IF(J160=\"\",\"\",0.005*W160*(IF($E$14>=8,8,$E$14))*$E$15*4*12*IF(N36=\"Nej\",$E$18-10%,$E$18)*(1-IF(U160=\"ja\",0.63,0)))","v":0},{"$f":"IF(J160=\"\",\"\",0.005*X160*(IF($E$14>=8,8,$E$14))*$E$15*4*12*IF(N36=\"Nej\",$E$19+10%,$E$19)*(1-IF(U160=\"ja\",0.63,0)))","v":0},{"$f":"IF(J160=\"\",\"\",IF($E$15<=5,0.005*Y160*($E$14-8)*$E$15*4*12*(1-IF(U160=\"ja\",0.63,0)),0.005*Y160*(($E$14-8)*$E$15+($E$15-5)*16)*4*12*(1-IF($M36=\"ja\",0.63,0))))","v":0},{"$f":"IF(AD160=0,\"\",Z160+AA160+AB160)","v":""},{"$f":"IF(B36<=$E$12,1,0)","v":0},{"$f":"IF(A36=\"\",0,IF(A36=A35,AE159,IF(A36<>A35,1+AE159)))","v":0}]
[{"$f":"IF(B37=\"\",0,D37*E37*F37/100*3600)","v":0},{"$f":"IF($B37=\"\",0,$D37*$H37*I37/100*3600)","v":0},{"$f":"IF($B37=\"\",0,$D37*$H37*J37/100*3600)","v":0},{"$f":"IF(B37=\"\",0,0.005*A161*(IF($E$14>=8,8,$E$14))*$E$15*4*12*$E$18*(1-IF($M37=\"ja\",0.63,0)))","v":0},{"$f":"IF(B37=\"\",0,0.005*B161*(IF($E$14>=8,8,$E$14))*$E$15*4*12*$E$19*(1-IF($M37=\"ja\",0.63,0)))","v":0},{"$f":"IF(B37=\"\",0,IF($E$15<=5,0.005*C161*($E$14-8)*$E$15*4*12*(1-IF($M37=\"ja\",0.63,0)),0.005*C161*(($E$14-8)*$E$15+($E$15-5)*16)*4*12*(1-IF($M37=\"ja\",0.63,0))))","v":0},"",0,"",7,null,0,0,0,null,0,0,0,null,0,"Ja",null,0,0,0,0,0,0,"",0,0]
[0,0,0,0,0,0,"",0,"",8,null,0,0,0,null,0,0,0,null,0,"Ja",null,0,0,0,0,0,0,"",0,0]
[0,0,0,0,0,0,"",0,"",9,null,0,0,0,null,0,0,0,null,0,"Ja",null,0,0,0,0,0,0,"",0,0]
[0,0,0,0,{"$f":"IF(B40=\"\",0,0.005*B164*(IF($E$14>=8,8,$E$14))*$E$15*4*12*$E$19*(1-IF($M40=\"ja\",0.63,0)))","v":0},0,"",0,"",10,null,0,0,0,null,0,0,0,null,0,"Ja",null,0,0,0,0,0,0,"",0,0]
[0,0,0,0,{"$f":"IF(B41=\"\",0,0.005*B165*(IF($E$14>=8,8,$E$14))*$E$15*4*12*$E$19*(1-IF($M41=\"ja\",0.63,0)))","v":0},0,"",0,"",11,null,0,0,0,null,0,0,0,null,0,"Ja",null,0,0,0,0,0,0,"",0,0]
[0,0,0,0,0,0,"",0,"",12,null,0,0,0,null,0,0,0,null,0,"Ja",null,0,0,0,0,0,0,"",0,0]
[0,0,0,0,0,0,"",0,"",13,null,0,0,0,null,0,0,0,null,0,"Ja",null,0,0,0,0,0,0,"",0,0]
[0,0,0,0,0,0,"",0,"",14,null,0,0,0,null,0,0,0,null,0,"Ja",null,0,0,0,0,0,0,"",0,0]
[0,0,0,0,0,0,"",0,"",15,null,0,0,0,null,0,0,0,null,0,"Ja",null,0,0,0,0,0,0,"",0,0]
[0,0,0,0,0,0,"",0,"",16,null,0,0,0,null,0,0,0,null,0,"Ja",null,0,0,0,0,0,0,"",0,0]
[0,0,0,0,0,0,"",0,"",17,null,0,0,0,null,0,0,0,null,0,"Ja",null,0,0,0,0,0,0,"",0,0]
[0,0,0,0,0,0,"",0,"",18,null,0,0,0,null,0,0,0,null,0,"Ja",null,0,0,0,0,0,0,"",0,0]
[0,0,0,0,0,0,"",0,"",19,null,0,0,0,null,0,0,0,null,0,"Ja",null,0,0,0,0,0,0,"",0,0]
[0,0,0,0,0,0,"",0,"",20,null,0,0,0,null,0,0,0,null,0,"Ja",null,0,0,0,0,0,0,"",0,0]
[0,0,0,0,0,0,"",0,"",21,null,0,0,0,null,0,0,0,null,0,"Ja",null,0,0,0,0,0,0,"",0,0]
[0,0,0,0,0,0,"",0,"",22,null,0,0,0,null,0,0,0,null,0,"Ja",null,0,0,0,0,0,0,"",0,0]
[0,0,0,0,0,0,"",0,"",23,null,0,0,0,null,0,0,0,null,0,"Ja",null,0,0,0,0,0,0,"",0,0]
[0,0,0,0,0,0,"",0,"",24,null,0,0,0,null,0,0,0,null,0,"Ja",null,0,0,0,0,0,0,"",0,0]
[0,0,0,0,0,0,"",0,"",25,null,0,0,0,null,0,0,0,null,0,"Ja",null,0,0,0,0,0,0,"",0,0]
[0,0,0,0,0,0,"",0,"",26,null,0,0,0,null,0,0,0,null,0,"Ja",null,0,0,0,0,0,0,"",0,0]
[0,0,0,0,0,0,"",0,"",27,null,0,0,0,null,0,0,0,null,0,"Ja",null,0,0,0,0,0,0,"",0,0]
[0,0,0,0,0,0,"",0,"",28,null,0,0,0,null,0,0,0,null,0,"Ja",null,0,0,0,0,0,0,"",0,0]
[0,0,0,0,0,0,"",0,"",29,null,0,0,0,null,0,0,0,null,0,"Ja",null,0,0,0,0,0,0,"",0,0]
[0,0,0,0,0,0,"",0,"",30,null,0,0,0,null,0,0,0,null,0,"Ja",null,0,0,0,0,0,0,"",0,0]
[0,0,0,0,0,0,"",0,"",31,null,0,0,0,null,0,0,0,null,0,"Ja",null,0,0,0,0,0,0,"",0,0]
[0,0,0,0,0,0,"",0,"",32,null,0,0,0,null,0,0,0,null,0,"Ja",null,0,0,0,0,0,0,"",0,0]
[0,0,0,0,0,0,"",0,"",33,null,0,0,0,null,0,0,0,null,0,"Ja",null,0,0,0,0,0,0,"",0,0]
[0,0,0,0,0,0,"",0,"",34,null,0,0,0,null,0,0,0,null,0,"Ja",null,0,0,0,0,0,0,"",0,0]
[0,0,0,0,0,0,"",0,"",35,null,0,0,0,null,0,0,0,null,0,"Ja",null,0,0,0,0,0,0,"",0,0]
[0,0,0,0,0,0,"",0,"",36,null,0,0,0,null,0,0,0,null,0,"Ja",null,0,0,0,0,0,0,"",0,0]
[0,0,0,0,0,0,"",0,"",37,null,0,0,0,null,0,0,0,null,0,"Ja",null,0,0,0,0,0,0,"",0,0]
[0,0,0,0,0,0,"",0,"",38,null,0,0,0,null,0,0,0,null,0,"Ja",null,0,0,0,0,0,0,"",0,0]
[0,0,0,0,0,0,"",0,"",39,null,0,0,0,null,0,0,0,null,0,"Ja",null,0,0,0,0,0,0,"",0,0]
[0,0,0,0,0,0,"",0,"",40,null,0,0,0,null,0,0,0,null,0,"Ja",null,0,0,0,0,0,0,"",0,0]
[0,0,0,0,0,0,"",0,"",41,null,0,0,0,null,0,0,0,null,0,"Ja",null,0,0,0,0,0,0,"",0,0]
[0,0,0,0,0,0,"",0,"",42,null,0,0,0,null,0,0,0,null,0,"Ja",null,0,0,0,0,0,0,"",0,0]
[0,0,0,0,0,0,"",0,"",43,null,0,0,0,null,0,0,0,null,0,"Ja",null,0,0,0,0,0,0,"",0,0]
[0,0,0,0,0,0,"",0,"",44,null,0,0,0,null,0,0,0,null,0,"Ja",null,0,0,0,0,0,0,"",0,0]
[0,0,0,0,0,0,"",0,"",45,null,0,0,0,null,0,0,0,null,0,"Ja",null,0,0,0,0,0,0,"",0,0]
[0,0,0,0,0,0,"",0,"",46,null,0,0,0,null,0,0,0,null,0,"Ja",null,0,0,0,0,0,0,"",0,0]
[0,0,0,0,0,0,"",0,"",47,null,0,0,0,null,0,0,0,null,0,"Ja",null,0,0,0,0,0,0,"",0,0]
[0,0,0,0,0,0,"",0,"",48,null,0,0,0,null,0,0,0,null,0,"Ja",null,0,0,0,0,0,0,"",0,0]
[0,0,0,0,0,0,"",0,"",49,null,0,0,0,null,0,0,0,null,0,"Ja",null,0,0,0,0,0,0,"",0,0]
[0,0,0,0,0,0,"",0,"",50,null,0,0,0,null,0,0,0,null,0,"Ja",null,0,0,0,0,0,0,"",0,0]
[0,0,0,0,0,0,"",0,"",51,null,0,0,0,null,0,0,0,null,0,"Ja",null,0,0,0,0,0,0,"",0,0]
[0,0,0,0,0,0,"",0,"",52,null,0,0,0,null,0,0,0,null,0,"Ja",null,0,0,0,0,0,0,"",0,0]
[0,0,0,0,0,0,"",0,"",53,null,0,0,0,null,0,0,0,null,0,"Ja",null,0,0,0,0,0,0,"",0,0]
[0,0,0,0,0,0,"",0,"",54,null,0,0,0,null,0,0,0,null,0,"Ja",null,0,0,0,0,0,0,"",0,0]
[0,0,0,0,0,0,"",0,"",55,null,0,0,0,null,0,0,0,null,0,"Ja",null,0,0,0,0,0,0,"",0,0]
[0,0,0,0,0,0,"",0,"",56,null,0,0,0,null,0,0,0,null,0,"Ja",null,0,0,0,0,0,0,"",0,0]
[0,0,0,0,0,0,"",0,"",57,null,0,0,0,null,0,0,0,null,0,"Ja",null,0,0,0,0,0,0,"",0,0]
[0,0,0,0,0,0,"",0,"",58,null,0,0,0,null,0,0,0,null,0,"Ja",null,0,0,0,0,0,0,"",0,0]
[0,0,0,0,0,0,"",0,"",59,null,0,0,0,null,0,0,0,null,0,"Ja",null,0,0,0,0,0,0,"",0,0]
[0,0,0,0,0,0,"",0,"",60,null,0,0,0,null,0,0,0,null,0,"Ja",null,0,0,0,0,0,0,"",0,0]
[0,0,0,0,0,0,"",0,"",61,null,0,0,0,null,0,0,0,null,0,"Ja",null,0,0,0,0,0,0,"",0,0]
[0,0,0,0,0,0,"",0,"",62,null,0,0,0,null,0,0,0,null,0,"Ja",null,0,0,0,0,0,0,"",0,0]
[0,0,0,0,0,0,"",0,"",63,null,0,0,0,null,0,0,0,null,0,"Ja",null,0,0,0,0,0,0,"",0,0]
[0,0,0,0,0,0,"",0,"",64,null,0,0,0,null,0,0,0,null,0,"Ja",null,0,0,0,0,0,0,"",0,0]
[0,0,0,0,0,0,"",0,"",65,null,0,0,0,null,0,0,0,null,0,"Ja",null,0,0,0,0,0,0,"",0,0]
[0,0,0,0,0,0,"",0,"",66,null,0,0,0,null,0,0,0,null,0,"Ja",null,0,0,0,0,0,0,"",0,0]
[0,0,0,0,0,0,"",0,"",67,null,0,0,0,null,0,0,0,null,0,"Ja",null,0,0,0,0,0,0,"",0,0]
[0,0,0,0,0,0,"",0,"",68,null,0,0,0,null,0,0,0,null,0,"Ja",null,0,0,0,0,0,0,"",0,0]
[0,0,0,0,0,0,"",0,"",69,null,0,0,0,null,0,0,0,null,0,"Ja",null,0,0,0,0,0,0,"",0,0]
[0,0,0,0,0,0,{"$f":"IF(H224=0,\"\",D224+E224+F224)","v":""},{"$f":"IF(B100<=$E$12,1,0)","v":0},{"$f":"IF(A100=\"\",\"\",A100)","v":""},{"$f":"B100","v":70},null,{"$f":"D100","v":0},{"$f":"E100","v":0},{"$f":"IF(AND($E$24=\"Nej\",OR(E94=$AA$16,$E$26=\"Ja\")),IF(F100>=0.4,0.4,F100),F100)","v":0},null,{"$f":"IF(H100>5,5,H100)","v":0},{"$f":"IF(I100>=0.3,0.3,I100)","v":0},{"$f":"IF(J100>=0.1,0.1,J100)","v":0},null,{"$f":"L100","v":0},"Ja",null,{"$f":"IF(J224=\"\",\"\",L224*M224*N224/100*3600)","v":0},{"$f":"IF(J224=\"\",\"\",L224*P224*Q224/100*3600)","v":0},{"$f":"IF(J224=\"\",\"\",L224*P224*R224/100*3600)","v":0},{"$f":"IF(J224=\"\",\"\",0.005*W224*(IF($E$14>=8,8,$E$14))*$E$15*4*12*IF(N100=\"Nej\",$E$18-10%,$E$18)*(1-IF(U224=\"ja\",0.63,0)))","v":0},{"$f":"IF(J224=\"\",\"\",0.005*X224*(IF($E$14>=8,8,$E$14))*$E$15*4*12*IF(N100=\"Nej\",$E$19+10%,$E$19)*(1-IF(U224=\"ja\",0.63,0)))","v":0},{"$f":"IF(J224=\"\",\"\",IF($E$15<=5,0.005*Y224*($E$14-8)*$E$15*4*12*(1-IF(U224=\"ja\",0.63,0)),0.005*Y224*(($E$14-8)*$E$15+($E$15-5)*16)*4*12*(1-IF($M100=\"ja\",0.63,0))))","v":0},{"$f":"IF(AD224=0,\"\",Z224+AA224+AB224)","v":""},{"$f":"IF(B100<=$E$12,1,0)","v":0},{"$f":"IF(A100=\"\",0,IF(A100=A99,AE223,IF(A100<>A99,1+AE223)))","v":0}]
[{"$f":"IF(B101=\"\",0,D101*E101*F101/100*3600)","v":0},{"$f":"IF($B101=\"\",0,$D101*$H101*I101/100*3600)","v":0},{"$f":"IF($B101=\"\",0,$D101*$H101*J101/100*3600)","v":0},{"$f":"IF(B101=\"\",0,0.005*A225*(IF($E$14>=8,8,$E$14))*$E$15*4*12*$E$18*(1-IF($M101=\"ja\",0.63,0)))","v":0},0,{"$f":"IF(B101=\"\",0,IF($E$15<=5,0.005*C225*($E$14-8)*$E$15*4*12*(1-IF($M101=\"ja\",0.63,0)),0.005*C225*(($E$14-8)*$E$15+($E$15-5)*16)*4*12*(1-IF($M101=\"ja\",0.63,0))))","v":0},"",0,"",71,null,0,0,0,null,0,0,0,null,0,"Ja",null,0,0,0,0,0,0,"",0,0]
[0,0,0,0,0,0,"",0,"",72,null,0,0,0,null,0,0,0,null,0,"Ja",null,0,0,0,0,0,0,"",0,0]
[0,0,0,0,0,0,"",0,"",73,null,0,0,0,null,0,0,0,null,0,"Ja",null,0,0,0,0,0,0,"",0,0]
[0,0,0,0,0,0,"",0,"",74,null,0,0,0,null,0,0,0,null,0,"Ja",null,0,0,0,0,0,0,"",0,0]
[0,0,0,0,{"$f":"IF(B105=\"\",0,0.005*B229*(IF($E$14>=8,8,$E$14))*$E$15*4*12*$E$19*(1-IF($M105=\"ja\",0.63,0)))","v":0},0,"",0,"",75,null,0,0,0,null,0,0,0,null,0,"Ja",null,0,0,0,0,0,0,"",0,0]
[0,0,0,0,0,0,"",0,"",76,null,0,0,0,null,0,0,0,null,0,"Ja",null,0,0,0,0,0,0,"",0,0]
[0,0,0,0,0,0,"",0,"",77,null,0,0,0,null,0,0,0,null,0,"Ja",null,0,0,0,0,0,0,"",0,0]
[0,0,0,0,0,0,"",0,"",78,null,0,0,0,null,0,0,0,null,0,"Ja",null,0,0,0,0,0,0,"",0,0]
[0,0,0,0,0,0,"",0,"",79,null,0,0,0,null,0,0,0,null,0,"Ja",null,0,0,0,0,0,0,"",0,0]
[0,0,0,0,0,0,"",0,"",80,null,0,0,0,null,0,0,0,null,0,"Ja",null,0,0,0,0,0,0,"",0,0]
[0,0,0,0,0,0,"",0,"",81,null,0,0,0,null,0,0,0,null,0,"Ja",null,0,0,0,0,0,0,"",0,0]
[0,0,0,0,0,0,"",0,"",82,null,0,0,0,null,0,0,0,null,0,"Ja",null,0,0,0,0,0,0,"",0,0]
[0,0,0,0,0,0,"",0,"",83,null,0,0,0,null,0,0,0,null,0,"Ja",null,0,0,0,0,0,0,"",0,0]
[0,0,0,0,0,0,"",0,"",84,null,0,0,0,null,0,0,0,null,0,"Ja",null,0,0,0,0,0,0,"",0,0]
[0,0,0,0,0,0,"",0,"",85,null,0,0,0,null,0,0,0,null,0,"Ja",null,0,0,0,0,0,0,"",0,0]
[0,0,0,0,0,0,"",0,"",86,null,0,0,0,null,0,0,0,null,0,"Ja",null,0,0,0,0,0,0,"",0,0]
[0,0,0,0,0,0,"",0,"",87,null,0,0,0,null,0,0,0,null,0,"Ja",null,0,0,0,0,0,0,"",0,0]
[0,0,0,0,0,0,"",0,"",88,null,0,0,0,null,0,0,0,null,0,"Ja",null,0,0,0,0,0,0,"",0,0]
[0,0,0,0,0,0,"",0,"",89,null,0,0,0,null,0,0,0,null,0,"Ja",null,0,0,0,0,0,0,"",0,0]
[0,0,0,0,0,0,"",0,"",90,null,0,0,0,null,0,0,0,null,0,"Ja",null,0,0,0,0,0,0,"",0,0]
[0,0,0,0,0,0,"",0,"",91,null,0,0,0,null,0,0,0,null,0,"Ja",null,0,0,0,0,0,0,"",0,0]
[0,0,0,0,0,0,"",0,"",92,null,0,0,0,null,0,0,0,null,0,"Ja",null,0,0,0,0,0,0,"",0,0]
[0,0,0,0,0,0,"",0,"",93,null,0,0,0,null,0,0,0,null,0,"Ja",null,0,0,0,0,0,0,"",0,0]
[0,0,0,0,0,0,"",0,"",94,null,0,0,0,null,0,0,0,null,0,"Ja",null,0,0,0,0,0,0,"",0,0]
[0,0,0,0,0,0,"",0,"",95,null,0,0,0,null,0,0,0,null,0,"Ja",null,0,0,0,0,0,0,"",0,0]
[0,0,0,0,0,0,"",0,"",96,null,0,0,0,null,0,0,0,null,0,"Ja",null,0,0,0,0,0,0,"",0,0]
[0,0,0,0,0,0,"",0,"",97,null,0,0,0,null,0,0,0,null,0,"Ja",null,0,0,0,0,0,0,"",0,0]
[0,0,0,0,0,0,"",0,"",98,null,0,0,0,null,0,0,0,null,0,"Ja",null,0,0,0,0,0,0,"",0,0]
[0,0,0,0,0,0,"",0,"",99,null,0,0,0,null,0,0,0,null,0,"Ja",null,0,0,0,0,0,0,"",0,0]
[0,0,0,0,0,0,"",0,"",100,null,0,0,0,null,0,0,0,null,0,"Ja",null,0,0,0,0,0,0,"",0,0]
[]
[{"$f":"SUM(A155:A254)","v":4500},{"$f":"SUM(B155:B254)","v":648},{"$f":"SUM(C155:C254)","v":648},null,null,null,{"$f":"SUM(G155:G254)","v":11615.89248},null,null,null,null,null,null,null,null,null,null,null,null,null,null,null,{"$f":"SUM(W155:W254)","v":4500},{"$f":"SUM(X155:X254)","v":270},{"$f":"SUM(Y155:Y254)","v":90},null,null,null,{"$f":"SUM(AC155:AC254)","v":5917.2767999999996}]

{"sheet":"Ventilatorer","index":2,"n_rows":73,"n_cols":44,"rows_kept":73,"cut":false,"hidden":true,"merged":[[39,1,40,1],[39,3,40,3],[39,4,40,4],[39,10,40,10],[39,9,40,9],[39,8,40,8],[39,7,40,7],[5,0,9,7],[12,5,12,6],[13,5,13,6],[16,5,16,6],[17,5,17,6],[40,28,40,30],[41,25,41,27],[41,28,41,30],[41,22,41,24],[40,40,40,42],[41,34,41,36],[41,37,41,39],[41,40,41,42]],"read":"row_number_cap"}
["Ventilatorer"]
[]
[null,null,"Målt",null,"Oplyst",null,"Beregnet"]
["Signatur:"]
[]
["Guide til målinger og registreringer til bestemmelse af ventilatorers elforbrug - Læs guide ved at trykke på       billedikonet til højre for teksten     →"]
[]
[]
[]
[]
[]
[null,null,null,null,null,null,null,null,null,null,null,null,null,null,null,null,null,null,null,null,null,null,null,null,"antal aggregater"]
[{"$f":"'Stinkskabe, LAF-bænke'!A14","v":"Driftstimer pr. dag"},null,null,null,null,{"$f":"'Stinkskabe, LAF-bænke'!E14","v":10},null,{"$f":"'Stinkskabe, LAF-bænke'!F14","v":"timer pr. dag"},null,null,"Guide",null,null,null,null,null,null,null,null,null,null,null,1,"Nær sugeside",{"$f":"'Stinkskabe, LAF-bænke'!AJ155","v":1.0000000000000031},1,"F-hjul"]
[{"$f":"'Stinkskabe, LAF-bænke'!A15","v":"Antal dage om ugen"},null,null,null,null,{"$f":"'Stinkskabe, LAF-bænke'!E15","v":7},null,{"$f":"'Stinkskabe, LAF-bænke'!F15","v":"dage pr. uge"},null,null,null,null,null,null,null,null,null,null,null,null,null,null,2,"Fjerneste punkt",null,2,"B-hjul"]
[]
[]
["Skønnet tid hvor stinkskabene er fuldt åbne",null,null,null,null,{"$f":"'Stinkskabe, LAF-bænke'!E18","v":0.3}]
["Skønnet tid hvor stinkskabene er lukkede",null,null,null,null,{"$f":"'Stinkskabe, LAF-bænke'!E19","v":0.7}]
[]
[]
[]
[]
[]
[]
[]
[]
[]
[]
[]
[]
[]
[]
[]
[]
[]
[]
[]
[]
[]
["Aggregat","Ventilatortype",null,"Antal ventilatorer","Trykføler           placering",null,null,"Tryk efter ventilator","Tryk før ventilator","Tryk ved fjerneste punkt af kanalstrækning","Tryk efter stinkskab",null,null,null,null,null,null,null,null,"Aktuelle forbrug",null,null,null,null,null,null,null,null,null,null,null,null,null,"Tiltag: Alle tiltag"]
["Anlægsnr.",null,null,null,null,null,null,null,null,null,null,null,null,null,null,null,null,null,"Aggregatnr.","Ventilatorplacering","Ventilatortype","Totalvirkningsgrad","Luftmængde åbent","Luftmængde lukket","Luftmængde uden for arbejdstiden","Målepunkt 1","Målepunkt 2","Trykdifferens","Energiforbrug",null,null,"Aktuelle energiforbrug",null,"Totalvirkningsgrad","Luftmængde åbent","Luftmængde lukket","Luftmængde uden for arbejdstiden","Målepunkt 1","Målepunkt 2","Trykdifferens","Energiforbrug",null,null,"Aktuelle energiforbrug"]
[null,null,null,null,null,null,null,"(Målepunkt 1)","(Målepunkt 2)","(Målepunkt 3)","(Målepunkt 4)",null,null,null,null,null,null,null,null,null,null,null,"[m3/h]",null,null,"[Pa]",null,null,"[kWh/år]",null,null,"[kWh/år]",null,null,"[m3/h]",null,null,"[Pa]",null,null,"[kWh/år]",null,null,"[kWh/år]"]
[{"$f":"IF(ISERROR(INDEX('Stinkskabe, LAF-bænke'!$A$31:$A$130,MATCH(1,'Stinkskabe, LAF-bænke'!$AE$155:$AE$254,0))),\"\",INDEX('Stinkskabe, LAF-bænke'!$A$31:$A$130,MATCH(1,'Stinkskabe, LAF-bænke'!$AE$155:$AE$254,0)))","v":"VE01"},"B-hjul",null,1,"Nær sugeside",null,null,40,100,60,40,null,null,null,null,null,null,null,{"$f":"A43","v":"VE01"},{"$f":"INDEX($W$13:$W$14,MATCH(E43,$X$13:$X$14,0))","v":1},{"$f":"INDEX($Z$13:$Z$14,MATCH(B43,$AA$13:$AA$14,0))","v":2},{"$f":"IF(U43=2,0.5,0.4)","v":0.5},{"$f":"SUM(IF('Stinkskabe, LAF-bænke'!$AE$155:$AE$254=1,'Stinkskabe, LAF-bænke'!$A$155:$A$254))","v":4500},{"$f":"SUM(IF('Stinkskabe, LAF-bænke'!$AE$155:$AE$254=1,'Stinkskabe, LAF-bænke'!$B$155:$B$254))","v":648},{"$f":"SUM(IF('Stinkskabe, LAF-bænke'!$AE$155:$AE$254=1,'Stinkskabe, LAF-bænke'!$C$155:$C$254))","v":648},{"$f":"H43","v":40},{"$f":"I43","v":100},{"$f":"Z43+AA43","v":140},{"$f":"W43/3600*AB43/V43*(IF($F$13>=8,8,$F$13))*$F$14*52*$F$17/1000","v":305.76},{"$f":"X43/3600*AB43/V43*(IF($F$13>=8,8,$F$13))*$F$14*52*$F$18/1000","v":102.73536},{"$f":"IF($F$14<=5,Y43/3600*AB43/V43*(IF($F$13<8,0,$F$13-8))*$F$14*52,Y43/3600*AB43/V43*24*($F$14-5)*52)/1000","v":125.7984},{"$f":"(AC43+AD43+AE43)*D43","v":534.29376000000002},null,0.5,{"$f":"SUM(IF('Stinkskabe, LAF-bænke'!$AE$155:$AE$254=1,'Stinkskabe, LAF-bænke'!$W$155:$W$254))","v":4500},{"$f":"SUM(IF('Stinkskabe, LAF-bænke'!$AE$155:$AE$254=1,'Stinkskabe, LAF-bænke'!$X$155:$X$254))","v":270},{"$f":"SUM(IF('Stinkskabe, LAF-bænke'!$AE$155:$AE$254=1,'Stinkskabe, LAF-bænke'!$Y$155:$Y$254))","v":90},{"$f":"H43","v":40},{"$f":"IF(T43=1,J43-(K43-40)+(I43-J43)*(AI43/W43)^2,AA43)","v":100},{"$f":"AL43+AM43","v":140},{"$f":"IF(AH43=\"\",\"\",AI43/3600*AN43/AH43*(IF($F$13>=8,8,$F$13))*$F$14*52*$F$17/1000)","v":305.76},{"$f":"IF(AH43=\"\",\"\",AJ43/3600*AN43/AH43*(IF($F$13>=8,8,$F$13))*$F$14*52*$F$18/1000)","v":42.806399999999996},{"$f":"IF($F$14<=5,AK43/3600*AN43/AH43*(IF($F$13<8,0,$F$13-8))*$F$14*52,AK43/3600*AN43/AH43*24*($F$14-5)*52)/1000","v":17.472000000000001},{"$f":"IF(AH43=\"\",\"\",(AO43+AP43+AQ43)*D43)","v":366.03839999999997}]
[{"$f":"IF(ISERROR(INDEX('Stinkskabe, LAF-bænke'!$A$31:$A$130,MATCH(2,'Stinkskabe, LAF-bænke'!$AE$155:$AE$254,0))),\"\",INDEX('Stinkskabe, LAF-bænke'!$A$31:$A$130,MATCH(2,'Stinkskabe, LAF-bænke'!$AE$155:$AE$254,0)))","v":""},"B-hjul",null,2,"Fjerneste punkt",null,null,40,500,150,110,null,null,null,null,null,null,null,{"$f":"A44","v":""},{"$f":"INDEX($W$13:$W$14,MATCH(E44,$X$13:$X$14,0))","v":2},{"$f":"INDEX($Z$13:$Z$14,MATCH(B44,$AA$13:$AA$14,0))","v":2},{"$f":"IF(U44=2,0.5,0.4)","v":0.5},{"$f":"SUM(IF('Stinkskabe, LAF-bænke'!$AE$155:$AE$254=2,'Stinkskabe, LAF-bænke'!$A$155:$A$254))","v":0},{"$f":"SUM(IF('Stinkskabe, LAF-bænke'!$AE$155:$AE$254=2,'Stinkskabe, LAF-bænke'!$B$155:$B$254))","v":0},{"$f":"SUM(IF('Stinkskabe, LAF-bænke'!$AE$155:$AE$254=2,'Stinkskabe, LAF-bænke'!$C$155:$C$254))","v":0},{"$f":"H44","v":40},{"$f":"I44","v":500},{"$f":"Z44+AA44","v":540},{"$f":"W44/3600*AB44/V44*(IF($F$13>=8,8,$F$13))*$F$14*52*$F$17/1000","v":0},{"$f":"X44/3600*AB44/V44*(IF($F$13>=8,8,$F$13))*$F$14*52*$F$18/1000","v":0},{"$f":"IF($F$14<=5,Y44/3600*AB44/V44*(IF($F$13<8,0,$F$13-8))*$F$14*52,Y44/3600*AB44/V44*24*($F$14-5)*52)/1000","v":0},{"$f":"(AC44+AD44+AE44)*D44","v":0},null,0.5,{"$f":"SUM(IF('Stinkskabe, LAF-bænke'!$AE$155:$AE$254=2,'Stinkskabe, LAF-bænke'!$W$155:$W$254))","v":0},{"$f":"SUM(IF('Stinkskabe, LAF-bænke'!$AE$155:$AE$254=2,'Stinkskabe, LAF-bænke'!$X$155:$X$254))","v":0},{"$f":"SUM(IF('Stinkskabe, LAF-bænke'!$AE$155:$AE$254=2,'Stinkskabe, LAF-bænke'!$Y$155:$Y$254))","v":0},{"$f":"H44","v":40},{"$f":"IF(T44=1,J44-(K44-40)+(I44-J44)*(AI44/W44)^2,AA44)","v":500},{"$f":"AL44+AM44","v":540},{"$f":"IF(AH44=\"\",\"\",AI44/3600*AN44/AH44*(IF($F$13>=8,8,$F$13))*$F$14*52*$F$17/1000)","v":0},{"$f":"IF(AH44=\"\",\"\",AJ44/3600*AN44/AH44*(IF($F$13>=8,8,$F$13))*$F$14*52*$F$18/1000)","v":0},{"$f":"IF($F$14<=5,AK44/3600*AN44/AH44*(IF($F$13<8,0,$F$13-8))*$F$14*52,AK44/3600*AN44/AH44*24*($F$14-5)*52)/1000","v":0},{"$f":"IF(AH44=\"\",\"\",(AO44+AP44+AQ44)*D44)","v":0}]
[{"$f":"IF(ISERROR(INDEX('Stinkskabe, LAF-bænke'!$A$31:$A$130,MATCH(3,'Stinkskabe, LAF-bænke'!$AE$155:$AE$254,0))),\"\",INDEX('Stinkskabe, LAF-bænke'!$A$31:$A$130,MATCH(3,'Stinkskabe, LAF-bænke'!$AE$155:$AE$254,0)))","v":""},"B-hjul",null,2,"Fjerneste punkt",null,null,40,500,150,110,null,null,null,null,null,null,null,"",2,2,0.5,{"$f":"SUM(IF('Stinkskabe, LAF-bænke'!$AE$155:$AE$254=3,'Stinkskabe, LAF-bænke'!$A$155:$A$254))","v":0},{"$f":"SUM(IF('Stinkskabe, LAF-bænke'!$AE$155:$AE$254=3,'Stinkskabe, LAF-bænke'!$B$155:$B$254))","v":0},{"$f":"SUM(IF('Stinkskabe, LAF-bænke'!$AE$155:$AE$254=3,'Stinkskabe, LAF-bænke'!$C$155:$C$254))","v":0},40,500,540,0,0,0,0,null,0.5,{"$f":"SUM(IF('Stinkskabe, LAF-bænke'!$AE$155:$AE$254=3,'Stinkskabe, LAF-bænke'!$W$155:$W$254))","v":0},{"$f":"SUM(IF('Stinkskabe, LAF-bænke'!$AE$155:$AE$254=3,'Stinkskabe, LAF-bænke'!$X$155:$X$254))","v":0},{"$f":"SUM(IF('Stinkskabe, LAF-bænke'!$AE$155:$AE$254=3,'Stinkskabe, LAF-bænke'!$Y$155:$Y$254))","v":0},40,500,540,0,0,0,0]
[{"$f":"IF(ISERROR(INDEX('Stinkskabe, LAF-bænke'!$A$31:$A$130,MATCH(4,'Stinkskabe, LAF-bænke'!$AE$155:$AE$254,0))),\"\",INDEX('Stinkskabe, LAF-bænke'!$A$31:$A$130,MATCH(4,'Stinkskabe, LAF-bænke'!$AE$155:$AE$254,0)))","v":""},"B-hjul",null,null,"Fjerneste punkt",null,null,null,null,null,null,null,null,null,null,null,null,null,"",2,2,0.5,{"$f":"SUM(IF('Stinkskabe, LAF-bænke'!$AE$155:$AE$254=4,'Stinkskabe, LAF-bænke'!$A$155:$A$254))","v":0},{"$f":"SUM(IF('Stinkskabe, LAF-bænke'!$AE$155:$AE$254=4,'Stinkskabe, LAF-bænke'!$B$155:$B$254))","v":0},{"$f":"SUM(IF('Stinkskabe, LAF-bænke'!$AE$155:$AE$254=4,'Stinkskabe, LAF-bænke'!$C$155:$C$254))","v":0},0,0,0,0,0,0,0,null,0.5,{"$f":"SUM(IF('Stinkskabe, LAF-bænke'!$AE$155:$AE$254=4,'Stinkskabe, LAF-bænke'!$W$155:$W$254))","v":0},{"$f":"SUM(IF('Stinkskabe, LAF-bænke'!$AE$155:$AE$254=4,'Stinkskabe, LAF-bænke'!$X$155:$X$254))","v":0},{"$f":"SUM(IF('Stinkskabe, LAF-bænke'!$AE$155:$AE$254=4,'Stinkskabe, LAF-bænke'!$Y$155:$Y$254))","v":0},0,0,0,0,0,0,0]
[{"$f":"IF(ISERROR(INDEX('Stinkskabe, LAF-bænke'!$A$31:$A$130,MATCH(5,'Stinkskabe, LAF-bænke'!$AE$155:$AE$254,0))),\"\",INDEX('Stinkskabe, LAF-bænke'!$A$31:$A$130,MATCH(5,'Stinkskabe, LAF-bænke'!$AE$155:$AE$254,0)))","v":""},"B-hjul",null,null,"Fjerneste punkt",null,null,null,null,null,null,null,null,null,null,null,null,null,"",2,2,0.5,{"$f":"SUM(IF('Stinkskabe, LAF-bænke'!$AE$155:$AE$254=5,'Stinkskabe, LAF-bænke'!$A$155:$A$254))","v":0},{"$f":"SUM(IF('Stinkskabe, LAF-bænke'!$AE$155:$AE$254=5,'Stinkskabe, LAF-bænke'!$B$155:$B$254))","v":0},{"$f":"SUM(IF('Stinkskabe, LAF-bænke'!$AE$155:$AE$254=5,'Stinkskabe, LAF-bænke'!$C$155:$C$254))","v":0},0,0,0,0,0,0,0,null,0.5,{"$f":"SUM(IF('Stinkskabe, LAF-bænke'!$AE$155:$AE$254=5,'Stinkskabe, LAF-bænke'!$W$155:$W$254))","v":0},{"$f":"SUM(IF('Stinkskabe, LAF-bænke'!$AE$155:$AE$254=5,'Stinkskabe, LAF-bænke'!$X$155:$X$254))","v":0},{"$f":"SUM(IF('Stinkskabe, LAF-bænke'!$AE$155:$AE$254=5,'Stinkskabe, LAF-bænke'!$Y$155:$Y$254))","v":0},0,0,0,0,0,0,0]
[{"$f":"IF(ISERROR(INDEX('Stinkskabe, LAF-bænke'!$A$31:$A$130,MATCH(6,'Stinkskabe, LAF-bænke'!$AE$155:$AE$254,0))),\"\",INDEX('Stinkskabe, LAF-bænke'!$A$31:$A$130,MATCH(6,'Stinkskabe, LAF-bænke'!$AE$155:$AE$254,0)))","v":""},"B-hjul",null,null,"Fjerneste punkt",null,null,null,null,null,null,null,null,null,null,null,null,null,"",2,2,0.5,{"$f":"SUM(IF('Stinkskabe, LAF-bænke'!$AE$155:$AE$254=6,'Stinkskabe, LAF-bænke'!$A$155:$A$254))","v":0},{"$f":"SUM(IF('Stinkskabe, LAF-bænke'!$AE$155:$AE$254=6,'Stinkskabe, LAF-bænke'!$B$155:$B$254))","v":0},{"$f":"SUM(IF('Stinkskabe, LAF-bænke'!$AE$155:$AE$254=6,'Stinkskabe, LAF-bænke'!$C$155:$C$254))","v":0},0,0,0,0,0,0,0,null,0.5,{"$f":"SUM(IF('Stinkskabe, LAF-bænke'!$AE$155:$AE$254=6,'Stinkskabe, LAF-bænke'!$W$155:$W$254))","v":0},{"$f":"SUM(IF('Stinkskabe, LAF-bænke'!$AE$155:$AE$254=6,'Stinkskabe, LAF-bænke'!$X$155:$X$254))","v":0},{"$f":"SUM(IF('Stinkskabe, LAF-bænke'!$AE$155:$AE$254=6,'Stinkskabe, LAF-bænke'!$Y$155:$Y$254))","v":0},0,0,0,0,0,0,0]
[{"$f":"IF(ISERROR(INDEX('Stinkskabe, LAF-bænke'!$A$31:$A$130,MATCH(7,'Stinkskabe, LAF-bænke'!$AE$155:$AE$254,0))),\"\",INDEX('Stinkskabe, LAF-bænke'!$A$31:$A$130,MATCH(7,'Stinkskabe, LAF-bænke'!$AE$155:$AE$254,0)))","v":""},"B-hjul",null,null,"Fjerneste punkt",null,null,null,null,null,null,null,null,null,null,null,null,null,"",2,2,0.5,{"$f":"SUM(IF('Stinkskabe, LAF-bænke'!$AE$155:$AE$254=7,'Stinkskabe, LAF-bænke'!$A$155:$A$254))","v":0},{"$f":"SUM(IF('Stinkskabe, LAF-bænke'!$AE$155:$AE$254=7,'Stinkskabe, LAF-bænke'!$B$155:$B$254))","v":0},{"$f":"SUM(IF('Stinkskabe, LAF-bænke'!$AE$155:$AE$254=7,'Stinkskabe, LAF-bænke'!$C$155:$C$254))","v":0},0,0,0,0,0,0,0,null,0.5,{"$f":"SUM(IF('Stinkskabe, LAF-bænke'!$AE$155:$AE$254=7,'Stinkskabe, LAF-bænke'!$W$155:$W$254))","v":0},{"$f":"SUM(IF('Stinkskabe, LAF-bænke'!$AE$155:$AE$254=7,'Stinkskabe, LAF-bænke'!$X$155:$X$254))","v":0},{"$f":"SUM(IF('Stinkskabe, LAF-bænke'!$AE$155:$AE$254=7,'Stinkskabe, LAF-bænke'!$Y$155:$Y$254))","v":0},{"$f":"H49","v":0},{"$f":"IF(T49=1,J49-(K49-40)+(I49-J49)*(AI49/W49)^2,AA49)","v":0},{"$f":"AL49+AM49","v":0},0,0,0,0]
[{"$f":"IF(ISERROR(INDEX('Stinkskabe, LAF-bænke'!$A$31:$A$130,MATCH(8,'Stinkskabe, LAF-bænke'!$AE$155:$AE$254,0))),\"\",INDEX('Stinkskabe, LAF-bænke'!$A$31:$A$130,MATCH(8,'Stinkskabe, LAF-bænke'!$AE$155:$AE$254,0)))","v":""},"B-hjul",null,null,"Fjerneste punkt",null,null,null,null,null,null,null,null,null,null,null,null,null,"",2,2,0.5,{"$f":"SUM(IF('Stinkskabe, LAF-bænke'!$AE$155:$AE$254=8,'Stinkskabe, LAF-bænke'!$A$155:$A$254))","v":0},{"$f":"SUM(IF('Stinkskabe, LAF-bænke'!$AE$155:$AE$254=8,'Stinkskabe, LAF-bænke'!$B$155:$B$254))","v":0},{"$f":"SUM(IF('Stinkskabe, LAF-bænke'!$AE$155:$AE$254=8,'Stinkskabe, LAF-bænke'!$C$155:$C$254))","v":0},0,0,0,0,0,0,0,null,0.5,{"$f":"SUM(IF('Stinkskabe, LAF-bænke'!$AE$155:$AE$254=8,'Stinkskabe, LAF-bænke'!$W$155:$W$254))","v":0},{"$f":"SUM(IF('Stinkskabe, LAF-bænke'!$AE$155:$AE$254=8,'Stinkskabe, LAF-bænke'!$X$155:$X$254))","v":0},{"$f":"SUM(IF('Stinkskabe, LAF-bænke'!$AE$155:$AE$254=8,'Stinkskabe, LAF-bænke'!$Y$155:$Y$254))","v":0},0,0,0,0,0,0,0]
[{"$f":"IF(ISERROR(INDEX('Stinkskabe, LAF-bænke'!$A$31:$A$130,MATCH(9,'Stinkskabe, LAF-bænke'!$AE$155:$AE$254,0))),\"\",INDEX('Stinkskabe, LAF-bænke'!$A$31:$A$130,MATCH(9,'Stinkskabe, LAF-bænke'!$AE$155:$AE$254,0)))","v":""},"B-hjul",null,null,"Fjerneste punkt",null,null,null,null,null,null,null,null,null,null,null,null,null,"",2,2,0.5,{"$f":"SUM(IF('Stinkskabe, LAF-bænke'!$AE$155:$AE$254=9,'Stinkskabe, LAF-bænke'!$A$155:$A$254))","v":0},{"$f":"SUM(IF('Stinkskabe, LAF-bænke'!$AE$155:$AE$254=9,'Stinkskabe, LAF-bænke'!$B$155:$B$254))","v":0},{"$f":"SUM(IF('Stinkskabe, LAF-bænke'!$AE$155:$AE$254=9,'Stinkskabe, LAF-bænke'!$C$155:$C$254))","v":0},0,0,0,0,0,0,0,null,0.5,{"$f":"SUM(IF('Stinkskabe, LAF-bænke'!$AE$155:$AE$254=9,'Stinkskabe, LAF-bænke'!$W$155:$W$254))","v":0},{"$f":"SUM(IF('Stinkskabe, LAF-bænke'!$AE$155:$AE$254=9,'Stinkskabe, LAF-bænke'!$X$155:$X$254))","v":0},{"$f":"SUM(IF('Stinkskabe, LAF-bænke'!$AE$155:$AE$254=9,'Stinkskabe, LAF-bænke'!$Y$155:$Y$254))","v":0},0,0,0,0,0,0,0]
[{"$f":"IF(ISERROR(INDEX('Stinkskabe, LAF-bænke'!$A$31:$A$130,MATCH(10,'Stinkskabe, LAF-bænke'!$AE$155:$AE$254,0))),\"\",INDEX('Stinkskabe, LAF-bænke'!$A$31:$A$130,MATCH(10,'Stinkskabe, LAF-bænke'!$AE$155:$AE$254,0)))","v":""},"B-hjul",null,null,"Fjerneste punkt",null,null,null,null,null,null,null,null,null,null,null,null,null,"",2,2,0.5,{"$f":"SUM(IF('Stinkskabe, LAF-bænke'!$AE$155:$AE$254=10,'Stinkskabe, LAF-bænke'!$A$155:$A$254))","v":0},{"$f":"SUM(IF('Stinkskabe, LAF-bænke'!$AE$155:$AE$254=10,'Stinkskabe, LAF-bænke'!$B$155:$B$254))","v":0},{"$f":"SUM(IF('Stinkskabe, LAF-bænke'!$AE$155:$AE$254=10,'Stinkskabe, LAF-bænke'!$C$155:$C$254))","v":0},0,0,0,0,0,0,0,null,0.5,{"$f":"SUM(IF('Stinkskabe, LAF-bænke'!$AE$155:$AE$254=10,'Stinkskabe, LAF-bænke'!$W$155:$W$254))","v":0},{"$f":"SUM(IF('Stinkskabe, LAF-bænke'!$AE$155:$AE$254=10,'Stinkskabe, LAF-bænke'!$X$155:$X$254))","v":0},{"$f":"SUM(IF('Stinkskabe, LAF-bænke'!$AE$155:$AE$254=10,'Stinkskabe, LAF-bænke'!$Y$155:$Y$254))","v":0},0,0,0,0,0,0,0]
[{"$f":"IF(ISERROR(INDEX('Stinkskabe, LAF-bænke'!$A$31:$A$130,MATCH(11,'Stinkskabe, LAF-bænke'!$AE$155:$AE$254,0))),\"\",INDEX('Stinkskabe, LAF-bænke'!$A$31:$A$130,MATCH(11,'Stinkskabe, LAF-bænke'!$AE$155:$AE$254,0)))","v":""},"B-hjul",null,null,"Fjerneste punkt",null,null,null,null,null,null,null,null,null,null,null,null,null,"",2,2,0.5,{"$f":"SUM(IF('Stinkskabe, LAF-bænke'!$AE$155:$AE$254=11,'Stinkskabe, LAF-bænke'!$A$155:$A$254))","v":0},{"$f":"SUM(IF('Stinkskabe, LAF-bænke'!$AE$155:$AE$254=11,'Stinkskabe, LAF-bænke'!$B$155:$B$254))","v":0},{"$f":"SUM(IF('Stinkskabe, LAF-bænke'!$AE$155:$AE$254=11,'Stinkskabe, LAF-bænke'!$C$155:$C$254))","v":0},0,0,0,0,0,0,0,null,0.5,{"$f":"SUM(IF('Stinkskabe, LAF-bænke'!$AE$155:$AE$254=11,'Stinkskabe, LAF-bænke'!$W$155:$W$254))","v":0},{"$f":"SUM(IF('Stinkskabe, LAF-bænke'!$AE$155:$AE$254=11,'Stinkskabe, LAF-bænke'!$X$155:$X$254))","v":0},{"$f":"SUM(IF('Stinkskabe, LAF-bænke'!$AE$155:$AE$254=11,'Stinkskabe, LAF-bænke'!$Y$155:$Y$254))","v":0},0,0,0,0,0,0,0]
[{"$f":"IF(ISERROR(INDEX('Stinkskabe, LAF-bænke'!$A$31:$A$130,MATCH(12,'Stinkskabe, LAF-bænke'!$AE$155:$AE$254,0))),\"\",INDEX('Stinkskabe, LAF-bænke'!$A$31:$A$130,MATCH(12,'Stinkskabe, LAF-bænke'!$AE$155:$AE$254,0)))","v":""},"B-hjul",null,null,"Fjerneste punkt",null,null,null,null,null,null,null,null,null,null,null,null,null,"",2,2,0.5,{"$f":"SUM(IF('Stinkskabe, LAF-bænke'!$AE$155:$AE$254=12,'Stinkskabe, LAF-bænke'!$A$155:$A$254))","v":0},{"$f":"SUM(IF('Stinkskabe, LAF-bænke'!$AE$155:$AE$254=12,'Stinkskabe, LAF-bænke'!$B$155:$B$254))","v":0},{"$f":"SUM(IF('Stinkskabe, LAF-bænke'!$AE$155:$AE$254=12,'Stinkskabe, LAF-bænke'!$C$155:$C$254))","v":0},0,0,0,0,0,0,0,null,0.5,{"$f":"SUM(IF('Stinkskabe, LAF-bænke'!$AE$155:$AE$254=12,'Stinkskabe, LAF-bænke'!$W$155:$W$254))","v":0},{"$f":"SUM(IF('Stinkskabe, LAF-bænke'!$AE$155:$AE$254=12,'Stinkskabe, LAF-bænke'!$X$155:$X$254))","v":0},{"$f":"SUM(IF('Stinkskabe, LAF-bænke'!$AE$155:$AE$254=12,'Stinkskabe, LAF-bænke'!$Y$155:$Y$254))","v":0},0,0,0,0,0,0,0]
[{"$f":"IF(ISERROR(INDEX('Stinkskabe, LAF-bænke'!$A$31:$A$130,MATCH(13,'Stinkskabe, LAF-bænke'!$AE$155:$AE$254,0))),\"\",INDEX('Stinkskabe, LAF-bænke'!$A$31:$A$130,MATCH(13,'Stinkskabe, LAF-bænke'!$AE$155:$AE$254,0)))","v":""},"B-hjul",null,null,"Fjerneste punkt",null,null,null,null,null,null,null,null,null,null,null,null,null,"",2,2,0.5,{"$f":"SUM(IF('Stinkskabe, LAF-bænke'!$AE$155:$AE$254=13,'Stinkskabe, LAF-bænke'!$A$155:$A$254))","v":0},{"$f":"SUM(IF('Stinkskabe, LAF-bænke'!$AE$155:$AE$254=13,'Stinkskabe, LAF-bænke'!$B$155:$B$254))","v":0},{"$f":"SUM(IF('Stinkskabe, LAF-bænke'!$AE$155:$AE$254=13,'Stinkskabe, LAF-bænke'!$C$155:$C$254))","v":0},0,0,0,0,0,0,0,null,0.5,{"$f":"SUM(IF('Stinkskabe, LAF-bænke'!$AE$155:$AE$254=13,'Stinkskabe, LAF-bænke'!$W$155:$W$254))","v":0},{"$f":"SUM(IF('Stinkskabe, LAF-bænke'!$AE$155:$AE$254=13,'Stinkskabe, LAF-bænke'!$X$155:$X$254))","v":0},{"$f":"SUM(IF('Stinkskabe, LAF-bænke'!$AE$155:$AE$254=13,'Stinkskabe, LAF-bænke'!$Y$155:$Y$254))","v":0},0,0,0,0,0,0,0]
[{"$f":"IF(ISERROR(INDEX('Stinkskabe, LAF-bænke'!$A$31:$A$130,MATCH(14,'Stinkskabe, LAF-bænke'!$AE$155:$AE$254,0))),\"\",INDEX('Stinkskabe, LAF-bænke'!$A$31:$A$130,MATCH(14,'Stinkskabe, LAF-bænke'!$AE$155:$AE$254,0)))","v":""},"B-hjul",null,null,"Fjerneste punkt",null,null,null,null,null,null,null,null,null,null,null,null,null,"",2,2,0.5,{"$f":"SUM(IF('Stinkskabe, LAF-bænke'!$AE$155:$AE$254=14,'Stinkskabe, LAF-bænke'!$A$155:$A$254))","v":0},{"$f":"SUM(IF('Stinkskabe, LAF-bænke'!$AE$155:$AE$254=14,'Stinkskabe, LAF-bænke'!$B$155:$B$254))","v":0},{"$f":"SUM(IF('Stinkskabe, LAF-bænke'!$AE$155:$AE$254=14,'Stinkskabe, LAF-bænke'!$C$155:$C$254))","v":0},0,0,0,0,0,0,0,null,0.5,{"$f":"SUM(IF('Stinkskabe, LAF-bænke'!$AE$155:$AE$254=14,'Stinkskabe, LAF-bænke'!$W$155:$W$254))","v":0},{"$f":"SUM(IF('Stinkskabe, LAF-bænke'!$AE$155:$AE$254=14,'Stinkskabe, LAF-bænke'!$X$155:$X$254))","v":0},{"$f":"SUM(IF('Stinkskabe, LAF-bænke'!$AE$155:$AE$254=14,'Stinkskabe, LAF-bænke'!$Y$155:$Y$254))","v":0},0,0,0,0,0,0,0]
[{"$f":"IF(ISERROR(INDEX('Stinkskabe, LAF-bænke'!$A$31:$A$130,MATCH(15,'Stinkskabe, LAF-bænke'!$AE$155:$AE$254,0))),\"\",INDEX('Stinkskabe, LAF-bænke'!$A$31:$A$130,MATCH(15,'Stinkskabe, LAF-bænke'!$AE$155:$AE$254,0)))","v":""},"B-hjul",null,null,"Fjerneste punkt",null,null,null,null,null,null,null,null,null,null,null,null,null,"",2,2,0.5,{"$f":"SUM(IF('Stinkskabe, LAF-bænke'!$AE$155:$AE$254=15,'Stinkskabe, LAF-bænke'!$A$155:$A$254))","v":0},{"$f":"SUM(IF('Stinkskabe, LAF-bænke'!$AE$155:$AE$254=15,'Stinkskabe, LAF-bænke'!$B$155:$B$254))","v":0},{"$f":"SUM(IF('Stinkskabe, LAF-bænke'!$AE$155:$AE$254=15,'Stinkskabe, LAF-bænke'!$C$155:$C$254))","v":0},0,0,0,0,0,0,0,null,0.5,{"$f":"SUM(IF('Stinkskabe, LAF-bænke'!$AE$155:$AE$254=15,'Stinkskabe, LAF-bænke'!$W$155:$W$254))","v":0},{"$f":"SUM(IF('Stinkskabe, LAF-bænke'!$AE$155:$AE$254=15,'Stinkskabe, LAF-bænke'!$X$155:$X$254))","v":0},{"$f":"SUM(IF('Stinkskabe, LAF-bænke'!$AE$155:$AE$254=15,'Stinkskabe, LAF-bænke'!$Y$155:$Y$254))","v":0},0,0,0,0,0,0,0]
[{"$f":"IF(ISERROR(INDEX('Stinkskabe, LAF-bænke'!$A$31:$A$130,MATCH(16,'Stinkskabe, LAF-bænke'!$AE$155:$AE$254,0))),\"\",INDEX('Stinkskabe, LAF-bænke'!$A$31:$A$130,MATCH(16,'Stinkskabe, LAF-bænke'!$AE$155:$AE$254,0)))","v":""},"B-hjul",null,null,"Fjerneste punkt",null,null,null,null,null,null,null,null,null,null,null,null,null,"",2,2,0.5,{"$f":"SUM(IF('Stinkskabe, LAF-bænke'!$AE$155:$AE$254=16,'Stinkskabe, LAF-bænke'!$A$155:$A$254))","v":0},{"$f":"SUM(IF('Stinkskabe, LAF-bænke'!$AE$155:$AE$254=16,'Stinkskabe, LAF-bænke'!$B$155:$B$254))","v":0},{"$f":"SUM(IF('Stinkskabe, LAF-bænke'!$AE$155:$AE$254=16,'Stinkskabe, LAF-bænke'!$C$155:$C$254))","v":0},0,0,0,0,0,0,0,null,0.5,{"$f":"SUM(IF('Stinkskabe, LAF-bænke'!$AE$155:$AE$254=16,'Stinkskabe, LAF-bænke'!$W$155:$W$254))","v":0},{"$f":"SUM(IF('Stinkskabe, LAF-bænke'!$AE$155:$AE$254=16,'Stinkskabe, LAF-bænke'!$X$155:$X$254))","v":0},{"$f":"SUM(IF('Stinkskabe, LAF-bænke'!$AE$155:$AE$254=16,'Stinkskabe, LAF-bænke'!$Y$155:$Y$254))","v":0},0,0,0,0,0,0,0]
[{"$f":"IF(ISERROR(INDEX('Stinkskabe, LAF-bænke'!$A$31:$A$130,MATCH(17,'Stinkskabe, LAF-bænke'!$AE$155:$AE$254,0))),\"\",INDEX('Stinkskabe, LAF-bænke'!$A$31:$A$130,MATCH(17,'Stinkskabe, LAF-bænke'!$AE$155:$AE$254,0)))","v":""},"B-hjul",null,null,"Fjerneste punkt",null,null,null,null,null,null,null,null,null,null,null,null,null,"",2,2,0.5,{"$f":"SUM(IF('Stinkskabe, LAF-bænke'!$AE$155:$AE$254=17,'Stinkskabe, LAF-bænke'!$A$155:$A$254))","v":0},{"$f":"SUM(IF('Stinkskabe, LAF-bænke'!$AE$155:$AE$254=17,'Stinkskabe, LAF-bænke'!$B$155:$B$254))","v":0},{"$f":"SUM(IF('Stinkskabe, LAF-bænke'!$AE$155:$AE$254=17,'Stinkskabe, LAF-bænke'!$C$155:$C$254))","v":0},0,0,0,0,0,0,0,null,0.5,{"$f":"SUM(IF('Stinkskabe, LAF-bænke'!$AE$155:$AE$254=17,'Stinkskabe, LAF-bænke'!$W$155:$W$254))","v":0},{"$f":"SUM(IF('Stinkskabe, LAF-bænke'!$AE$155:$AE$254=17,'Stinkskabe, LAF-bænke'!$X$155:$X$254))","v":0},{"$f":"SUM(IF('Stinkskabe, LAF-bænke'!$AE$155:$AE$254=17,'Stinkskabe, LAF-bænke'!$Y$155:$Y$254))","v":0},0,0,0,0,0,0,0]
[{"$f":"IF(ISERROR(INDEX('Stinkskabe, LAF-bænke'!$A$31:$A$130,MATCH(18,'Stinkskabe, LAF-bænke'!$AE$155:$AE$254,0))),\"\",INDEX('Stinkskabe, LAF-bænke'!$A$31:$A$130,MATCH(18,'Stinkskabe, LAF-bænke'!$AE$155:$AE$254,0)))","v":""},"B-hjul",null,null,"Fjerneste punkt",null,null,null,null,null,null,null,null,null,null,null,null,null,"",2,2,0.5,{"$f":"SUM(IF('Stinkskabe, LAF-bænke'!$AE$155:$AE$254=18,'Stinkskabe, LAF-bænke'!$A$155:$A$254))","v":0},{"$f":"SUM(IF('Stinkskabe, LAF-bænke'!$AE$155:$AE$254=18,'Stinkskabe, LAF-bænke'!$B$155:$B$254))","v":0},{"$f":"SUM(IF('Stinkskabe, LAF-bænke'!$AE$155:$AE$254=18,'Stinkskabe, LAF-bænke'!$C$155:$C$254))","v":0},0,0,0,0,0,0,0,null,0.5,{"$f":"SUM(IF('Stinkskabe, LAF-bænke'!$AE$155:$AE$254=18,'Stinkskabe, LAF-bænke'!$W$155:$W$254))","v":0},{"$f":"SUM(IF('Stinkskabe, LAF-bænke'!$AE$155:$AE$254=18,'Stinkskabe, LAF-bænke'!$X$155:$X$254))","v":0},{"$f":"SUM(IF('Stinkskabe, LAF-bænke'!$AE$155:$AE$254=18,'Stinkskabe, LAF-bænke'!$Y$155:$Y$254))","v":0},0,0,0,0,0,0,0]
[{"$f":"IF(ISERROR(INDEX('Stinkskabe, LAF-bænke'!$A$31:$A$130,MATCH(19,'Stinkskabe, LAF-bænke'!$AE$155:$AE$254,0))),\"\",INDEX('Stinkskabe, LAF-bænke'!$A$31:$A$130,MATCH(19,'Stinkskabe, LAF-bænke'!$AE$155:$AE$254,0)))","v":""},"B-hjul",null,null,"Fjerneste punkt",null,null,null,null,null,null,null,null,null,null,null,null,null,"",2,2,0.5,{"$f":"SUM(IF('Stinkskabe, LAF-bænke'!$AE$155:$AE$254=19,'Stinkskabe, LAF-bænke'!$A$155:$A$254))","v":0},{"$f":"SUM(IF('Stinkskabe, LAF-bænke'!$AE$155:$AE$254=19,'Stinkskabe, LAF-bænke'!$B$155:$B$254))","v":0},{"$f":"SUM(IF('Stinkskabe, LAF-bænke'!$AE$155:$AE$254=19,'Stinkskabe, LAF-bænke'!$C$155:$C$254))","v":0},0,0,0,0,0,0,0,null,0.5,{"$f":"SUM(IF('Stinkskabe, LAF-bænke'!$AE$155:$AE$254=19,'Stinkskabe, LAF-bænke'!$W$155:$W$254))","v":0},{"$f":"SUM(IF('Stinkskabe, LAF-bænke'!$AE$155:$AE$254=19,'Stinkskabe, LAF-bænke'!$X$155:$X$254))","v":0},{"$f":"SUM(IF('Stinkskabe, LAF-bænke'!$AE$155:$AE$254=19,'Stinkskabe, LAF-bænke'!$Y$155:$Y$254))","v":0},0,0,0,0,0,0,0]
[{"$f":"IF(ISERROR(INDEX('Stinkskabe, LAF-bænke'!$A$31:$A$130,MATCH(20,'Stinkskabe, LAF-bænke'!$AE$155:$AE$254,0))),\"\",INDEX('Stinkskabe, LAF-bænke'!$A$31:$A$130,MATCH(20,'Stinkskabe, LAF-bænke'!$AE$155:$AE$254,0)))","v":""},"B-hjul",null,null,"Fjerneste punkt",null,null,null,null,null,null,null,null,null,null,null,null,null,"",2,2,0.5,{"$f":"SUM(IF('Stinkskabe, LAF-bænke'!$AE$155:$AE$254=20,'Stinkskabe, LAF-bænke'!$A$155:$A$254))","v":0},{"$f":"SUM(IF('Stinkskabe, LAF-bænke'!$AE$155:$AE$254=20,'Stinkskabe, LAF-bænke'!$B$155:$B$254))","v":0},{"$f":"SUM(IF('Stinkskabe, LAF-bænke'!$AE$155:$AE$254=20,'Stinkskabe, LAF-bænke'!$C$155:$C$254))","v":0},0,0,0,0,0,0,0,null,0.5,{"$f":"SUM(IF('Stinkskabe, LAF-bænke'!$AE$155:$AE$254=20,'Stinkskabe, LAF-bænke'!$W$155:$W$254))","v":0},{"$f":"SUM(IF('Stinkskabe, LAF-bænke'!$AE$155:$AE$254=20,'Stinkskabe, LAF-bænke'!$X$155:$X$254))","v":0},{"$f":"SUM(IF('Stinkskabe, LAF-bænke'!$AE$155:$AE$254=20,'Stinkskabe, LAF-bænke'!$Y$155:$Y$254))","v":0},0,0,0,0,0,0,0]
[{"$f":"IF(ISERROR(INDEX('Stinkskabe, LAF-bænke'!$A$31:$A$130,MATCH(21,'Stinkskabe, LAF-bænke'!$AE$155:$AE$254,0))),\"\",INDEX('Stinkskabe, LAF-bænke'!$A$31:$A$130,MATCH(21,'Stinkskabe, LAF-bænke'!$AE$155:$AE$254,0)))","v":""},"B-hjul",null,null,"Fjerneste punkt",null,null,null,null,null,null,null,null,null,null,null,null,null,"",2,2,0.5,{"$f":"SUM(IF('Stinkskabe, LAF-bænke'!$AE$155:$AE$254=21,'Stinkskabe, LAF-bænke'!$A$155:$A$254))","v":0},{"$f":"SUM(IF('Stinkskabe, LAF-bænke'!$AE$155:$AE$254=21,'Stinkskabe, LAF-bænke'!$B$155:$B$254))","v":0},{"$f":"SUM(IF('Stinkskabe, LAF-bænke'!$AE$155:$AE$254=21,'Stinkskabe, LAF-bænke'!$C$155:$C$254))","v":0},0,0,0,0,0,0,0,null,0.5,{"$f":"SUM(IF('Stinkskabe, LAF-bænke'!$AE$155:$AE$254=21,'Stinkskabe, LAF-bænke'!$W$155:$W$254))","v":0},{"$f":"SUM(IF('Stinkskabe, LAF-bænke'!$AE$155:$AE$254=21,'Stinkskabe, LAF-bænke'!$X$155:$X$254))","v":0},{"$f":"SUM(IF('Stinkskabe, LAF-bænke'!$AE$155:$AE$254=21,'Stinkskabe, LAF-bænke'!$Y$155:$Y$254))","v":0},0,0,0,0,0,0,0]
[{"$f":"IF(ISERROR(INDEX('Stinkskabe, LAF-bænke'!$A$31:$A$130,MATCH(22,'Stinkskabe, LAF-bænke'!$AE$155:$AE$254,0))),\"\",INDEX('Stinkskabe, LAF-bænke'!$A$31:$A$130,MATCH(22,'Stinkskabe, LAF-bænke'!$AE$155:$AE$254,0)))","v":""},"B-hjul",null,null,"Fjerneste punkt",null,null,null,null,null,null,null,null,null,null,null,null,null,"",2,2,0.5,{"$f":"SUM(IF('Stinkskabe, LAF-bænke'!$AE$155:$AE$254=22,'Stinkskabe, LAF-bænke'!$A$155:$A$254))","v":0},{"$f":"SUM(IF('Stinkskabe, LAF-bænke'!$AE$155:$AE$254=22,'Stinkskabe, LAF-bænke'!$B$155:$B$254))","v":0},{"$f":"SUM(IF('Stinkskabe, LAF-bænke'!$AE$155:$AE$254=22,'Stinkskabe, LAF-bænke'!$C$155:$C$254))","v":0},0,0,0,0,0,0,0,null,0.5,{"$f":"SUM(IF('Stinkskabe, LAF-bænke'!$AE$155:$AE$254=22,'Stinkskabe, LAF-bænke'!$W$155:$W$254))","v":0},{"$f":"SUM(IF('Stinkskabe, LAF-bænke'!$AE$155:$AE$254=22,'Stinkskabe, LAF-bænke'!$X$155:$X$254))","v":0},{"$f":"SUM(IF('Stinkskabe, LAF-bænke'!$AE$155:$AE$254=22,'Stinkskabe, LAF-bænke'!$Y$155:$Y$254))","v":0},0,0,0,0,0,0,0]
[{"$f":"IF(ISERROR(INDEX('Stinkskabe, LAF-bænke'!$A$31:$A$130,MATCH(23,'Stinkskabe, LAF-bænke'!$AE$155:$AE$254,0))),\"\",INDEX('Stinkskabe, LAF-bænke'!$A$31:$A$130,MATCH(23,'Stinkskabe, LAF-bænke'!$AE$155:$AE$254,0)))","v":""},"B-hjul",null,null,"Fjerneste punkt",null,null,null,null,null,null,null,null,null,null,null,null,null,"",2,2,0.5,{"$f":"SUM(IF('Stinkskabe, LAF-bænke'!$AE$155:$AE$254=23,'Stinkskabe, LAF-bænke'!$A$155:$A$254))","v":0},{"$f":"SUM(IF('Stinkskabe, LAF-bænke'!$AE$155:$AE$254=23,'Stinkskabe, LAF-bænke'!$B$155:$B$254))","v":0},{"$f":"SUM(IF('Stinkskabe, LAF-bænke'!$AE$155:$AE$254=23,'Stinkskabe, LAF-bænke'!$C$155:$C$254))","v":0},0,0,0,0,0,0,0,null,0.5,{"$f":"SUM(IF('Stinkskabe, LAF-bænke'!$AE$155:$AE$254=23,'Stinkskabe, LAF-bænke'!$W$155:$W$254))","v":0},{"$f":"SUM(IF('Stinkskabe, LAF-bænke'!$AE$155:$AE$254=23,'Stinkskabe, LAF-bænke'!$X$155:$X$254))","v":0},{"$f":"SUM(IF('Stinkskabe, LAF-bænke'!$AE$155:$AE$254=23,'Stinkskabe, LAF-bænke'!$Y$155:$Y$254))","v":0},0,0,0,0,0,0,0]
[{"$f":"IF(ISERROR(INDEX('Stinkskabe, LAF-bænke'!$A$31:$A$130,MATCH(24,'Stinkskabe, LAF-bænke'!$AE$155:$AE$254,0))),\"\",INDEX('Stinkskabe, LAF-bænke'!$A$31:$A$130,MATCH(24,'Stinkskabe, LAF-bænke'!$AE$155:$AE$254,0)))","v":""},"B-hjul",null,null,"Fjerneste punkt",null,null,null,null,null,null,null,null,null,null,null,null,null,"",2,2,0.5,{"$f":"SUM(IF('Stinkskabe, LAF-bænke'!$AE$155:$AE$254=24,'Stinkskabe, LAF-bænke'!$A$155:$A$254))","v":0},{"$f":"SUM(IF('Stinkskabe, LAF-bænke'!$AE$155:$AE$254=24,'Stinkskabe, LAF-bænke'!$B$155:$B$254))","v":0},{"$f":"SUM(IF('Stinkskabe, LAF-bænke'!$AE$155:$AE$254=24,'Stinkskabe, LAF-bænke'!$C$155:$C$254))","v":0},0,0,0,0,0,0,0,null,0.5,{"$f":"SUM(IF('Stinkskabe, LAF-bænke'!$AE$155:$AE$254=24,'Stinkskabe, LAF-bænke'!$W$155:$W$254))","v":0},{"$f":"SUM(IF('Stinkskabe, LAF-bænke'!$AE$155:$AE$254=24,'Stinkskabe, LAF-bænke'!$X$155:$X$254))","v":0},{"$f":"SUM(IF('Stinkskabe, LAF-bænke'!$AE$155:$AE$254=24,'Stinkskabe, LAF-bænke'!$Y$155:$Y$254))","v":0},0,0,0,0,0,0,0]
[{"$f":"IF(ISERROR(INDEX('Stinkskabe, LAF-bænke'!$A$31:$A$130,MATCH(25,'Stinkskabe, LAF-bænke'!$AE$155:$AE$254,0))),\"\",INDEX('Stinkskabe, LAF-bænke'!$A$31:$A$130,MATCH(25,'Stinkskabe, LAF-bænke'!$AE$155:$AE$254,0)))","v":""},"B-hjul",null,null,"Fjerneste punkt",null,null,null,null,null,null,null,null,null,null,null,null,null,"",2,2,0.5,{"$f":"SUM(IF('Stinkskabe, LAF-bænke'!$AE$155:$AE$254=25,'Stinkskabe, LAF-bænke'!$A$155:$A$254))","v":0},{"$f":"SUM(IF('Stinkskabe, LAF-bænke'!$AE$155:$AE$254=25,'Stinkskabe, LAF-bænke'!$B$155:$B$254))","v":0},{"$f":"SUM(IF('Stinkskabe, LAF-bænke'!$AE$155:$AE$254=25,'Stinkskabe, LAF-bænke'!$C$155:$C$254))","v":0},0,0,0,0,0,0,0,null,0.5,{"$f":"SUM(IF('Stinkskabe, LAF-bænke'!$AE$155:$AE$254=25,'Stinkskabe, LAF-bænke'!$W$155:$W$254))","v":0},{"$f":"SUM(IF('Stinkskabe, LAF-bænke'!$AE$155:$AE$254=25,'Stinkskabe, LAF-bænke'!$X$155:$X$254))","v":0},{"$f":"SUM(IF('Stinkskabe, LAF-bænke'!$AE$155:$AE$254=25,'Stinkskabe, LAF-bænke'!$Y$155:$Y$254))","v":0},0,0,0,0,0,0,0]
[{"$f":"IF(ISERROR(INDEX('Stinkskabe, LAF-bænke'!$A$31:$A$130,MATCH(26,'Stinkskabe, LAF-bænke'!$AE$155:$AE$254,0))),\"\",INDEX('Stinkskabe, LAF-bænke'!$A$31:$A$130,MATCH(26,'Stinkskabe, LAF-bænke'!$AE$155:$AE$254,0)))","v":""},"B-hjul",null,null,"Fjerneste punkt",null,null,null,null,null,null,null,null,null,null,null,null,null,"",2,2,0.5,{"$f":"SUM(IF('Stinkskabe, LAF-bænke'!$AE$155:$AE$254=26,'Stinkskabe, LAF-bænke'!$A$155:$A$254))","v":0},{"$f":"SUM(IF('Stinkskabe, LAF-bænke'!$AE$155:$AE$254=26,'Stinkskabe, LAF-bænke'!$B$155:$B$254))","v":0},{"$f":"SUM(IF('Stinkskabe, LAF-bænke'!$AE$155:$AE$254=26,'Stinkskabe, LAF-bænke'!$C$155:$C$254))","v":0},0,0,0,0,0,0,0,null,0.5,{"$f":"SUM(IF('Stinkskabe, LAF-bænke'!$AE$155:$AE$254=26,'Stinkskabe, LAF-bænke'!$W$155:$W$254))","v":0},{"$f":"SUM(IF('Stinkskabe, LAF-bænke'!$AE$155:$AE$254=26,'Stinkskabe, LAF-bænke'!$X$155:$X$254))","v":0},{"$f":"SUM(IF('Stinkskabe, LAF-bænke'!$AE$155:$AE$254=26,'Stinkskabe, LAF-bænke'!$Y$155:$Y$254))","v":0},0,0,0,0,0,0,0]
[{"$f":"IF(ISERROR(INDEX('Stinkskabe, LAF-bænke'!$A$31:$A$130,MATCH(27,'Stinkskabe, LAF-bænke'!$AE$155:$AE$254,0))),\"\",INDEX('Stinkskabe, LAF-bænke'!$A$31:$A$130,MATCH(27,'Stinkskabe, LAF-bænke'!$AE$155:$AE$254,0)))","v":""},"B-hjul",null,null,"Fjerneste punkt",null,null,null,null,null,null,null,null,null,null,null,null,null,"",2,2,0.5,{"$f":"SUM(IF('Stinkskabe, LAF-bænke'!$AE$155:$AE$254=27,'Stinkskabe, LAF-bænke'!$A$155:$A$254))","v":0},{"$f":"SUM(IF('Stinkskabe, LAF-bænke'!$AE$155:$AE$254=27,'Stinkskabe, LAF-bænke'!$B$155:$B$254))","v":0},{"$f":"SUM(IF('Stinkskabe, LAF-bænke'!$AE$155:$AE$254=27,'Stinkskabe, LAF-bænke'!$C$155:$C$254))","v":0},0,0,0,0,0,0,0,null,0.5,{"$f":"SUM(IF('Stinkskabe, LAF-bænke'!$AE$155:$AE$254=27,'Stinkskabe, LAF-bænke'!$W$155:$W$254))","v":0},{"$f":"SUM(IF('Stinkskabe, LAF-bænke'!$AE$155:$AE$254=27,'Stinkskabe, LAF-bænke'!$X$155:$X$254))","v":0},{"$f":"SUM(IF('Stinkskabe, LAF-bænke'!$AE$155:$AE$254=27,'Stinkskabe, LAF-bænke'!$Y$155:$Y$254))","v":0},0,0,0,0,0,0,0]
[{"$f":"IF(ISERROR(INDEX('Stinkskabe, LAF-bænke'!$A$31:$A$130,MATCH(28,'Stinkskabe, LAF-bænke'!$AE$155:$AE$254,0))),\"\",INDEX('Stinkskabe, LAF-bænke'!$A$31:$A$130,MATCH(28,'Stinkskabe, LAF-bænke'!$AE$155:$AE$254,0)))","v":""},"B-hjul",null,null,"Fjerneste punkt",null,null,null,null,null,null,null,null,null,null,null,null,null,"",2,2,0.5,{"$f":"SUM(IF('Stinkskabe, LAF-bænke'!$AE$155:$AE$254=28,'Stinkskabe, LAF-bænke'!$A$155:$A$254))","v":0},{"$f":"SUM(IF('Stinkskabe, LAF-bænke'!$AE$155:$AE$254=28,'Stinkskabe, LAF-bænke'!$B$155:$B$254))","v":0},{"$f":"SUM(IF('Stinkskabe, LAF-bænke'!$AE$155:$AE$254=28,'Stinkskabe, LAF-bænke'!$C$155:$C$254))","v":0},0,0,0,0,0,0,0,null,0.5,{"$f":"SUM(IF('Stinkskabe, LAF-bænke'!$AE$155:$AE$254=28,'Stinkskabe, LAF-bænke'!$W$155:$W$254))","v":0},{"$f":"SUM(IF('Stinkskabe, LAF-bænke'!$AE$155:$AE$254=28,'Stinkskabe, LAF-bænke'!$X$155:$X$254))","v":0},{"$f":"SUM(IF('Stinkskabe, LAF-bænke'!$AE$155:$AE$254=28,'Stinkskabe, LAF-bænke'!$Y$155:$Y$254))","v":0},0,0,0,0,0,0,0]
[{"$f":"IF(ISERROR(INDEX('Stinkskabe, LAF-bænke'!$A$31:$A$130,MATCH(29,'Stinkskabe, LAF-bænke'!$AE$155:$AE$254,0))),\"\",INDEX('Stinkskabe, LAF-bænke'!$A$31:$A$130,MATCH(29,'Stinkskabe, LAF-bænke'!$AE$155:$AE$254,0)))","v":""},"B-hjul",null,null,"Fjerneste punkt",null,null,null,null,null,null,null,null,null,null,null,null,null,"",2,2,0.5,{"$f":"SUM(IF('Stinkskabe, LAF-bænke'!$AE$155:$AE$254=29,'Stinkskabe, LAF-bænke'!$A$155:$A$254))","v":0},{"$f":"SUM(IF('Stinkskabe, LAF-bænke'!$AE$155:$AE$254=29,'Stinkskabe, LAF-bænke'!$B$155:$B$254))","v":0},{"$f":"SUM(IF('Stinkskabe, LAF-bænke'!$AE$155:$AE$254=29,'Stinkskabe, LAF-bænke'!$C$155:$C$254))","v":0},0,0,0,0,0,0,0,null,0.5,{"$f":"SUM(IF('Stinkskabe, LAF-bænke'!$AE$155:$AE$254=29,'Stinkskabe, LAF-bænke'!$W$155:$W$254))","v":0},{"$f":"SUM(IF('Stinkskabe, LAF-bænke'!$AE$155:$AE$254=29,'Stinkskabe, LAF-bænke'!$X$155:$X$254))","v":0},{"$f":"SUM(IF('Stinkskabe, LAF-bænke'!$AE$155:$AE$254=29,'Stinkskabe, LAF-bænke'!$Y$155:$Y$254))","v":0},0,0,0,0,0,0,0]
[{"$f":"IF(ISERROR(INDEX('Stinkskabe, LAF-bænke'!$A$31:$A$130,MATCH(30,'Stinkskabe, LAF-bænke'!$AE$155:$AE$254,0))),\"\",INDEX('Stinkskabe, LAF-bænke'!$A$31:$A$130,MATCH(30,'Stinkskabe, LAF-bænke'!$AE$155:$AE$254,0)))","v":""},"B-hjul",null,null,"Fjerneste punkt",null,null,null,null,null,null,null,null,null,null,null,null,null,"",2,2,0.5,{"$f":"SUM(IF('Stinkskabe, LAF-bænke'!$AE$155:$AE$254=30,'Stinkskabe, LAF-bænke'!$A$155:$A$254))","v":0},{"$f":"SUM(IF('Stinkskabe, LAF-bænke'!$AE$155:$AE$254=30,'Stinkskabe, LAF-bænke'!$B$155:$B$254))","v":0},{"$f":"SUM(IF('Stinkskabe, LAF-bænke'!$AE$155:$AE$254=30,'Stinkskabe, LAF-bænke'!$C$155:$C$254))","v":0},0,0,0,0,0,0,0,null,0.5,{"$f":"SUM(IF('Stinkskabe, LAF-bænke'!$AE$155:$AE$254=30,'Stinkskabe, LAF-bænke'!$W$155:$W$254))","v":0},{"$f":"SUM(IF('Stinkskabe, LAF-bænke'!$AE$155:$AE$254=30,'Stinkskabe, LAF-bænke'!$X$155:$X$254))","v":0},{"$f":"SUM(IF('Stinkskabe, LAF-bænke'!$AE$155:$AE$254=30,'Stinkskabe, LAF-bænke'!$Y$155:$Y$254))","v":0},0,0,0,0,0,0,0]
[null,null,null,null,null,null,null,null,null,null,null,null,null,null,null,null,null,null,"Sum",null,null,null,{"$f":"SUM(W43:W72)","v":4500},{"$f":"SUM(X43:X72)","v":648},{"$f":"SUM(Y43:Y72)","v":648},null,null,null,null,null,null,{"$f":"SUM(AF43:AF72)","v":534.29376000000002},null,null,{"$f":"SUM(AI43:AI72)","v":4500},{"$f":"SUM(AJ43:AJ72)","v":270},{"$f":"SUM(AK43:AK72)","v":90},null,null,null,null,null,null,{"$f":"SUM(AR43:AR72)","v":366.03839999999997}]

{"sheet":"Besparelsespotentialer","index":3,"n_rows":17,"n_cols":1,"rows_kept":17,"cut":false,"hidden":true,"merged":[[9,0,10,14],[11,0,12,14],[2,0,2,14],[4,0,4,14]],"read":"row_number_cap"}
["Besparelsespotentialer"]
["Stinkskabe, LAF-bænke"]
["• Ved lufthastigheder over 0,4 m/s i lugen (fuldt åbent) foreslås reducering af lufthastighed til 0,4 m/s, såfremt der ikke arbejdes med sundhedsfarlige eller ukendte stoffer, at afstanden mellem ganglinie og stinkskabe er minimum 1,5 m og/eller der installeres en sugearm i stinkskabet"]
["• Ved lufthastigheder over 0,3 m/s i lugen (lukket) foreslås reducering af lufthastighed til 0,3 m/s i arbejdstiden"]
["• Ved lufthastigheder over 0,1 m/s i lugen (lukket) foreslås en reducering af lufthastigheden til 0,1 m/s uden for arbejdstiden. Dette kræver en overordnet styring af laboratoriet, hvor det sikres, at laboratoriet gennemskylles inden brug"]
["• Ved et tryk på over 40 Pa over stinkskabet foreslås reducering af tryk til 40 Pa. Se guide omkring opbygning af stinkskabe"]
["• Såfremt der ikke anvendes varmegenvinding foreslås etablering af dette. Det antages at varmegenvindingsgraden er 63%"]
[]
["Ventilatorer"]
["• Såfremt der anvendes ventilator med F-hjul foreslås denne udskiftet til en ventilator med B-hjul. Der antages en virkningsgrad på 40% for ventilatorer med F-hjul og 50% for ventilatorer med B-hjul"]
[]
["• Såfremt trykføleren der styrer ventilatoren, er placeret nær sugesiden, så foreslås denne flyttet til det fjerneste punkt i kanalsystemet. Herved reduceres trykstigningen over ventilatoren"]
[]
["• Ved en luftmængdereduktion reduceres elforbruget til ventilatordriften ligeledes"]
[]
["Driftstider"]
["• Alle timer i weekenden antages at være udenfor arbejdstid"]

{"sheet":"Sikkerhedsfaktor","index":4,"n_rows":33,"n_cols":18,"rows_kept":33,"cut":false,"hidden":true,"merged":[[20,2,20,3],[19,0,19,3],[2,0,5,1],[10,0,11,3]]}
["Sikkerhedsfaktor"]
[]
["Guide til målinger og registreringer af sikkerhedsfaktor - Læs guide ved tryk på billedikonet til højre for teksten   →"]
[]
[]
[]
[]
[]
[null,null,null,"        Guide"]
[]
["Opnåede sikkerhedsfaktorer ved minimum lufthastigheder i lugeåbning"]
[]
["Min lufthastighed i lugeåbning: 0,27 m/s  ","Sikkerhedsfaktor 1:",{"$f":"IF(P31=2,\"Ukendt\",IF(P31=1,\"Opnået\",\"Ikke opnået\"))","v":"Ukendt"}]
["Min lufthastighed i lugeåbning: 0,33 m/s  ","Sikkerhedsfaktor 10 (DS457 forslag):",{"$f":"IF(P31=2,\"Ukendt\",IF(P31=1,\"Opnået\",\"Ikke opnået\"))","v":"Ukendt"}]
["Min lufthastighed i lugeåbning: 0,41 m/s  ","Opnået sikkerhedsfaktor 40 ved:",{"$f":"IF(Q31=2,\"Ukendt\",IF(Q31=1,\"Opnået\",\"Ikke opnået\"))","v":"Ukendt"}]
["Min lufthastighed i lugeåbning: 0,45 m/s  ","Opnået sikkerhedsfaktor 100 ved:",{"$f":"IF(Q31=2,\"Ukendt\",IF(Q31=1,\"Opnået\",\"Ikke opnået\"))","v":"Ukendt"}]
["Min lufthastighed i lugeåbning: 0,50 m/s  ","Opnået sikkerhedsfaktor >10000 ved:",{"$f":"IF(Q31=2,\"Ukendt\",IF(Q31=1,\"Opnået\",\"Ikke opnået\"))","v":"Ukendt"}]
[]
[]
["Lufthastigheder i referencepunkter"]
["Målested",null,"Lufthastighed i lugeåbning [m/s]",null,null,null,null,null,"Målepunkt","Målinger",null,null,null,null,"Data til vurdering af sikkerhedsfaktoren"]
[null,null,0.3,0.5,null,null,null,null,null,null,0.3,0.5,1,null,0.2,0.3,0.5,1]
["Inde i stinkskabet ved målerørets munding [A]",null,"-",null,null,null,null,null,"A",null,null,0,0.13,null,{"$f":"IF(B23<=J23,1,0)","v":1},null,{"$f":"IF(D23=\"\",2,IF(D23<=L23,1,0))","v":2},{"$f":"IF(E23<=M23,1,0)","v":1}]
["Over stinkskabet ved højre hjørne 7 cm over skabets top [B]",null,"-",null,null,null,null,null,"B",null,null,0.16,0.39,null,{"$f":"IF(B24<=J24,1,0)","v":1},null,2,1]
["Over stinkskabet ved højre hjørne 21 cm over skabets top [C]",null,"-",null,null,null,null,null,"C",null,null,0.21,0.19,null,1,null,2,1]
["Over stinkskabet ved højre hjørne 21 cm under loft [D]",null,"-",null,null,null,null,null,"D",null,null,0.22,0.54,null,1,null,2,1]
["Over stinkskabet ved højre hjørne 7 cm under loft [E]",null,"-",null,null,null,null,null,"E",null,null,0.11,0.69,null,1,null,2,1]
["20 cm foran stinkskabet midt i stinkskabslugen i vertikal retning, 24 cm til venstre for venstre kant [F]",null,null,null,null,null,null,null,"F",null,0.1,0.11,0.25,null,1,{"$f":"IF(C28=\"\",2,IF(C28<=K28,1,0))","v":2},{"$f":"IF(D28=\"\",2,IF(D28<=L28,1,0))","v":2},1]
["20 cm foran stinkskabet midt i stinkskabslugen i vertikal retning, 2/3 til højre for venstre kant [G]",null,null,null,null,null,null,null,"G",null,0.04,7.0000000000000007E-2,0.15,null,1,{"$f":"IF(C29=\"\",2,IF(C29<=K29,1,0))","v":2},2,1]
["20 cm foran stinkskabet ved toppen af stinkskabet, 2/3 til højre for venstre kant [I]",null,null,null,null,null,null,null,"H",null,0.15,0.24,0.35,null,1,{"$f":"IF(C30=\"\",2,IF(C30<=K30,1,0))","v":2},2,1]
[null,null,null,null,null,null,null,null,null,null,null,null,null,null,{"$f":"IF(AVERAGE(O23:O30)=1,1,0)","v":1},{"$f":"IF(COUNTIF(P23:P30,2)>0,2,IF(AVERAGE(P23:P30)=1,1,0))","v":2},{"$f":"IF(COUNTIF(Q23:Q30,2)>0,2,IF(AVERAGE(Q23:Q30)=1,1,0))","v":2},{"$f":"IF(AVERAGE(R23:R30)=1,1,0)","v":1}]
[]
[null,null,null,null,null,null,null,null,"Opnået sikkerhedsfaktor:",null,{"$f":"IF(P31=1,\"1\",\"Mindre end 1\")","v":"Mindre end 1"},{"$f":"IF(Q31=1,\"Opnået\",\"Ikke opnået\")","v":"Ikke opnået"},{"$f":"IF(R31=1,\"Opnået\",\"Ikke opnået\")","v":"Opnået"}]

{"sheet":"Ventilator_EHH","index":5,"n_rows":81,"n_cols":40,"rows_kept":81,"cut":false,"hidden":true,"merged":[[1,9,6,14],[41,3,41,5],[7,21,8,27],[47,10,47,11]]}
[]
[null,null,null,null,null,null,null,null,null,"Guide til målinger og registreringer til bestemmelse af ventilatorers elforbrug - Læs guide ved at trykke på       billedikonet til højre for teksten     →"]
[null,null,null,"målt",null,"Oplyst",null,"beregnet"]
[null,"Signatur:"]
[]
[]
[]
[null,null,null,null,null,null,null,null,null,null,null,null,null,null,null,null,null,null,null,null,null,"7 eksempler på energioptimeringstilfælde"]
[]
[null,null,null,null,null,null,null,null,null,null,null,null,null,null,null,null,null,null,null,null,null,"Det kan ses at følerplacering i kanal længst fra ventilator (p5k) giver størst energibesparelse"]
[]
[null,"Denne registrering skal altid gennemføres først",null,null,null,null,null,null,null,null,null,null,null,null,null,null,null,null,null,null,null,null,"Konstant kørende ventilationsanlæg holder konstant sugetryk og suger på maks"]
[null,"maks flow:",null,{"$f":"SUM('Stinkskabe, LAF-bænke'!A155:A253)","v":4500},"m3/h",null,null,null,null,null,null,null,null,null,null,null,null,null,null,null,null,null,"ud fra føler ved sugeside af ventilator",null,null,null,"(Stinkskabsindløb er uændret)",null,null,null,"reference, "]
[null,null,null,null,null,null,null,null,null,null,null,null,null,null,null,null,null,null,null,null,null,null,"Tal ud fra makssituation",null,null,null,null,null,null,null,"dette felt må kun ",null,null,null,null,null,1,"Ved sugeside af ventilator"]
[null,null,null,null,null,null,null,null,null,null,null,null,null,null,null,null,null,null,null,null,null,null,"totalvirkningsgrad:",null,{"$f":"$F$47","v":0.4},null,"skriv 0,4 eller 0,6",null,null,null,"ændres mht ",null,null,null,null,null,2,"I kanal længst fra ventilator"]
[null,null,null,"relativ afstand fra ventilator målt langs hovedkanal",null,null,null,null,null,null,null,null,null,null,null,null,null,null,null,null,null,null,"aktuel flow=(max)",null,{"$f":"AB16*$D$13","v":4500},"m3/h","svarer til ",1,"af maks flow",null,"totalvirkningsgrad"]
[null,null,null,0,null,20,null,40,null,60,null,80,null,100,null,null,null,null,null,null,null,null,"dp tryk",null,{"$f":"$P$24*(Y16/$D$13)^2","v":75},null,null,null,null,null,null,null,null,null,null,null,{"$f":"INDEX(AK14:AK15,MATCH(AL17,AL14:AL15,0))","v":2},{"$f":"D42","v":"I kanal længst fra ventilator"}]
[null,null,null,null,null,null,null,null,null,null,null,null,null,null,null,null,null,null,null,null,null,null,"dp sug",null,{"$f":"$N$24","v":500},"*)1",null,"styres af regulator",null,null,null,null,null,null,null,null,null,false]
[null,null,null,"begyndelsessituation hvor der måles 5 værdier ved fuldt  maks flow",null,null,null,null,null,null,null,null,null,null,null,null,null,null,null,null,null,null,"dp trykdifferens",null,{"$f":"Y17+Y18","v":575},null,"pos tal"]
[null,null,null,null,null,null,null,null,null,null,null,null,null,null,null,null,null,null,null,null,null,null,"P maks:",null,{"$f":"Y16/3600*Y19/Y15","v":1796.875},"Watt"]
[null,null,null,null,null,null,null,null,null,null,null,null,null,null,null,null,null,null,null,null,null,null,null,null,null,null,null,null,null,null,null,null,null,null,null,null,null,{"$f":"$N$24","v":500},1,{"$f":"FALSE","v":false}]
[null,null,null,null,null,null,null,null,null,null,null,null,null,null,null,null,null,null,null,null,1,null,"Konstant kørende ventilationsanlæg holder konstant sugetryk",null,null,null,null,null,null,null,null,null,null,null,null,null,null,{"$f":"$N$24-(D28-40)","v":430},1,{"$f":"TRUE","v":true}]
[null,null,null,"p5k(kanal)",null,"p4k(kanal)",null,"p3k(kanal)",null,"p2k(kanal)",null,"p1",null,"    p0",null,null,null,null,null,null,null,null,"ud fra føler ved sugeside af ventilator",null,null,null,"(tryktab over stinkskabe reduceret til 40 Pa ved maks flow)",null,null,null,null,null,null,null,null,null,null,{"$f":"$D$24+($N$24-$D$24)*(F48/$D$13)^2","v":500},2,{"$f":"FALSE","v":false}]
[null,"Regulerende ",null,150,null,{"$f":"$D$24+($N$24-$D$24)*F$17/100","v":220},null,{"$f":"$D$24+($N$24-$D$24)*H$17/100","v":290},null,{"$f":"$D$24+($N$24-$D$24)*J$17/100","v":360},null,{"$f":"$D$24+($N$24-$D$24)*L$17/100","v":430},null,500,null,75,null,null,null,null,null,null,null,null,null,null,null,null,null,null,null,null,null,null,null,null,null,{"$f":"$D$24-($D$28-40)+($N$24-$D$24)*(F48/$D$13)^2","v":430},2,{"$f":"TRUE","v":true}]
[null,"Spjæld (x)",null,"X",null,"X",null,"X",null,"X",null,"X",null,"undertryk",null,"Pa",null,null,null,null,null,null,"totalvirkningsgrad:",null,{"$f":"$F$47","v":0.4},null,"skriv 0,4 eller 0,6"]
[null,null,null,null,null,null,null,null,null,null,null,null,null,null,null,null,null,null,null,null,null,null,"aktuel flow=(max)",null,{"$f":"AB26*$D$13","v":4500},"m3/h","svarer til ",1,"af maks flow",null,null,null,null,null,null,null,null,{"$f":"INDEX(AL21:AL24,MATCH(AK17&AL18,AM21:AM24&AN21:AN24,0))","v":500},"den korrekte formel der indsættes i celle F49"]
[null,null,null,"p5s",null,"p4s",null,"p4s",null,"p2s",null,"p1s",null,null,null,null,null,null,null,null,null,null,"dp tryk",null,{"$f":"$P$24*(Y26/$D$13)^2","v":75}]
[null,null,null,110,null,{"$f":"$D$28","v":110},null,{"$f":"$D$28","v":110},null,{"$f":"$D$28","v":110},null,{"$f":"$D$28","v":110},null,null,null,null,null,null,null,null,null,null,"dp sug",null,{"$f":"$N$24-(D28-40)","v":430},"*)1","pos tal","styres af regulator"]
[null,null,null,null,null,null,null,null,null,null,null,null,null,null,null,null,null,null,null,null,null,null,"dp trykdifferens",null,{"$f":"Y27+Y28","v":505}]
[null,null,null,null,null,null,null,null,null,null,null,null,null,null,null,null,null,null,null,null,null,null,"P maks:",null,{"$f":"Y26/3600*Y29/Y25","v":1578.125},"Watt"]
[]
[null,null,null,null,null,null,null,null,null,null,null,null,null,null,null,null,null,null,null,null,2,null,"Konstant kørende ventilationsanlæg holder konstant sugetryk"]
[null,null,null,null,null,null,null,null,null,null,null,null,null,null,null,null,null,null,null,null,null,null,"ud fra føler ved sugeside af ventilator",null,null,null,"(Stinkskabsindløb er uændret)"]
[]
[null,null,null,"skab helt åben",null,"skab helt åben",null,"skab helt åben",null,"skab helt åben",null,"skab helt åben",null,null,null,null,null,null,null,null,null,null,"totalvirkningsgrad:",null,{"$f":"$F$47","v":0.4},null,"skriv 0,4 eller 0,6"]
[null,null,null,null,null,null,null,null,null,null,null,null,null,null,null,null,null,null,null,null,null,null,"aktuel flow=(max)",null,{"$f":"AB36*$D$13","v":4050},"m3/h","svarer til ",0.9,"af maks flow"]
[null,null,null,null,null,null,null,null,null,null,null,null,null,null,null,null,null,null,null,null,null,null,"dp tryk",null,{"$f":"$P$24*(Y36/$D$13)^2","v":60.750000000000007}]
[null,null,null,null,null,null,null,null,null,null,null,null,null,null,null,null,null,null,null,null,null,null,"dp sug",null,{"$f":"$N$24","v":500},"*)1","pos tal","styres af regulator"]
[null,null,null,"Konstant kørende ventilationsanlæg holder konstant sugetryk",null,null,null,null,null,null,null,null,null,null,null,null,null,null,null,null,null,null,"dp trykdifferens",null,{"$f":"Y37+Y38","v":560.75}]
[null,null,null,null,null,null,null,null,null,null,null,null,null,null,null,null,null,null,null,null,null,null,"P maks:",null,{"$f":"Y36/3600*Y39/Y35","v":1577.109375},"Watt"]
[null,null,null,"Trykfølerplacering:"]
[null,null,null,"I kanal længst fra ventilator",null,null,"\u0080","    ← vælg på rullemenu",null,null,null,null,null,null,null,null,null,null,null,null,3,null,"Konstant kørende ventilationsanlæg holder konstant sugetryk"]
[null,null,null,null,null,null,null,null,null,null,null,null,null,null,null,null,null,null,null,null,null,null,"ud fra føler i kanal længst fra ventilator",null,null,null,"(Stinkskabsindløb er uændret)"]
[]
[]
[null,null,null,null,null,null,null,null,null,null,null,null,null,null,null,null,null,null,null,null,null,null,"totalvirkningsgrad:",null,{"$f":"$F$47","v":0.4},null,"skriv 0,4 eller 0,6"]
[null,null,null,"totalvirkningsgrad:",null,0.4,null,null,null,"← skriv 0,4 eller 0,6",null,null,null,null,null,null,null,null,null,null,null,null,"aktuel flow=(max)",null,{"$f":"AB47*$D$13","v":4050},"m3/h","svarer til ",0.9,"af maks flow"]
[null,null,null,"aktuel flow=(max)",null,{"$f":"D13","v":4500},"m3/h",null,null,"svarer til:",{"$f":"F48/$D$13","v":1},null,null,null,null,null,null,null,null,null,null,null,"dp tryk",null,{"$f":"$P$24*(Y47/$D$13)^2","v":60.750000000000007}]
[null,null,null,"dp tryk",null,{"$f":"$P$24*(F48/$D$13)^2","v":75},null,null,null,null,null,null,null,null,null,null,null,null,null,null,null,null,"dp sug",null,{"$f":"$D$24+($N$24-$D$24)*(Y47/$D$13)^2","v":433.5},"*)2","pos tal","styres af regulator"]
[null,null,null,"dp sug",null,{"$f":"AL26","v":500},null,null,null,"pos tal styres af regulator",null,null,null,null,null,null,null,null,null,null,null,null,"dp trykdiffferens",null,{"$f":"Y48+Y49","v":494.25}]
[null,null,null,"dp trykdifferens",null,{"$f":"F49+F50","v":575},null,null,null,null,null,null,null,null,null,null,null,null,null,null,null,null,"P maks:",null,{"$f":"Y47/3600*Y50/Y46","v":1390.078125},"Watt"]
[null,null,null,"P maks:",null,{"$f":"F48/3600*F51/F47","v":1796.875},"Watt"]
[null,null,null,null,null,null,null,null,null,null,null,null,null,null,null,null,null,null,null,null,4,null,"Konstant kørende ventilationsanlæg holder konstant sugetryk"]
[null,null,null,"Er føleren placeret nært sugesiden af ventilatoren",null,null,null,null,"Ja/nej",null,null,null,null,null,null,null,null,null,null,null,null,null,"ud fra føler i kanal længst fra ventilator"]
[null,null,null,"Anvendes der en ventilator med F-hjul mm.",null,null,null,null,"Ja/nej"]
[null,null,null,null,null,null,null,null,null,null,null,null,null,null,null,null,null,null,null,null,null,null,"totalvirkningsgrad:",null,{"$f":"$F$47","v":0.4},null,"skriv 0,4 eller 0,6"]
[null,null,null,null,null,null,null,null,null,null,null,null,null,null,null,null,null,null,null,null,null,null,"aktuel flow=(max)",null,{"$f":"AB57*$D$13","v":3150},"m3/h","svarer til ",0.7,"af maks flow"]
[null,null,null,null,null,null,null,null,null,null,null,null,null,null,null,null,null,null,null,null,null,null,"dp tryk",null,{"$f":"$P$24*(Y57/$D$13)^2","v":36.749999999999993}]
[null,null,null,null,null,null,null,null,null,null,null,null,null,null,null,null,null,null,null,null,null,null,"dp sug",null,{"$f":"$D$24+($N$24-$D$24)*(Y57/$D$13)^2","v":321.5},"*)2","pos tal","styres af regulator"]
[null,null,null,null,null,null,null,null,null,null,null,null,null,null,null,null,null,null,null,null,null,null,"dp trykdiffferens",null,{"$f":"Y58+Y59","v":358.25}]
[null,null,null,null,null,null,null,null,null,null,null,null,null,null,null,null,null,null,null,null,null,null,"P maks:",null,{"$f":"Y57/3600*Y60/Y56","v":783.671875},"Watt"]
[]
[null,null,null,null,null,null,null,null,null,null,null,null,null,null,null,null,null,null,null,null,5,null,"Konstant kørende ventilationsanlæg holder konstant sugetryk"]
[null,null,null,null,null,null,null,null,null,null,null,null,null,null,null,null,null,null,null,null,null,null,"ud fra føler i kanal længst fra ventilator",null,null,null,null,"(Stinkskabsindløb er uændret)"]
[]
[null,null,null,null,null,null,null,null,null,null,null,null,null,null,null,null,null,null,null,null,null,null,"totalvirkningsgrad:",null,{"$f":"$F$47","v":0.4},null,"skriv 0,4 eller 0,6"]
[null,null,null,null,null,null,null,null,null,null,null,null,null,null,null,null,null,null,null,null,null,null,"aktuel flow=(max)",null,{"$f":"AB67*$D$13","v":1800},"m3/h","svarer til ",0.4,"af maks flow"]
[null,null,null,null,null,null,null,null,null,null,null,null,null,null,null,null,null,null,null,null,null,null,"dp tryk",null,{"$f":"$P$24*(Y67/$D$13)^2","v":12.000000000000002}]
[null,null,null,null,null,null,null,null,null,null,null,null,null,null,null,null,null,null,null,null,null,null,"dp sug",null,{"$f":"$D$24+($N$24-$D$24)*(Y67/$D$13)^2","v":206},"*)2","pos tal","styres af regulator"]
[null,null,null,null,null,null,null,null,null,null,null,null,null,null,null,null,null,null,null,null,null,null,"dp trykdiffferens",null,{"$f":"Y68+Y69","v":218}]
[null,null,null,null,null,null,null,null,null,null,null,null,null,null,null,null,null,null,null,null,null,null,"P maks:",null,{"$f":"Y67/3600*Y70/Y66","v":272.5},"Watt"]
[]
[null,null,null,null,null,null,null,null,null,null,null,null,null,null,null,null,null,null,null,null,6,null,"Konstant kørende ventilationsanlæg holder konstant sugetryk"]
[null,null,null,null,null,null,null,null,null,null,null,null,null,null,null,null,null,null,null,null,null,null,"ud fra føler i kanal længst fra ventilator",null,null,null,"(tryktab over stinkskabe reduceret til 40 Pa ved maks flow)"]
[]
[null,null,null,null,null,null,null,null,null,null,null,null,null,null,null,null,null,null,null,null,null,null,"totalvirkningsgrad:",null,{"$f":"$F$47","v":0.4},null,"skriv 0,4 eller 0,6"]
[null,null,null,null,null,null,null,null,null,null,null,null,null,null,null,null,null,null,null,null,null,null,"aktuel flow=(max)",null,{"$f":"AB77*$D$13","v":900},"m3/h","svarer til ",0.2,"af maks flow"]
[null,null,null,null,null,null,null,null,null,null,null,null,null,null,null,null,null,null,null,null,null,null,"dp tryk",null,{"$f":"$P$24*(Y77/$D$13)^2","v":3.0000000000000004}]
[null,null,null,null,null,null,null,null,null,null,null,null,null,null,null,null,null,null,null,null,null,null,"dp sug",null,{"$f":"$D$24-($D$28-40)+($N$24-$D$24)*(Y77/$D$13)^2","v":94},"*)3",null,"styres af regulator"]
[null,null,null,null,null,null,null,null,null,null,null,null,null,null,null,null,null,null,null,null,null,null,"dp trykdiffferens",null,{"$f":"Y78+Y79","v":97},null,"pos tal"]
[null,null,null,null,null,null,null,null,null,null,null,null,null,null,null,null,null,null,null,null,null,null,"P maks:",null,{"$f":"Y77/3600*Y80/Y76","v":60.625},"Watt"]